{"text_format":"1","workbook":"xlsx","n_sheets":6,"sheets":["Full Rig","Cost Comparisons","Products Ordered","Notes","Hayn Catalog","Saved Configurations"],"not_rendered":{"charts":1,"images":37,"macros":1,"external_links":0,"defined_names":48,"comments":1,"pivot_tables":0},"unopened":[],"bounds":{"document_bytes":16777216,"sheet_cells":100000,"rows_first":2000,"rows_last":500,"rows_between":2000,"halvings":0,"cell_chars":16384,"cell_head_chars":4096},"cells_cut":0,"cells_raw":0,"read":"whole","date_system":"1900"}

{"sheet":"Full Rig","index":0,"n_rows":154,"n_cols":39,"rows_kept":154,"cut":false,"hidden":false,"merged":[[139,1,139,11],[140,1,140,11],[127,7,127,9],[130,4,130,6],[128,7,128,9],[130,7,130,9],[129,4,129,6],[129,7,129,9],[131,4,131,6],[131,7,131,9],[138,1,138,11],[134,4,134,6],[134,7,134,9],[136,7,136,9],[137,4,137,6],[137,7,137,9],[125,7,125,9],[133,4,133,6],[133,7,133,9],[132,4,132,6],[132,7,132,9],[126,7,126,9],[119,7,119,9],[123,4,123,6],[120,4,120,6],[121,4,121,6],[122,4,122,6],[124,4,124,6],[117,4,117,6],[118,4,118,6],[119,4,119,6],[117,2,117,3],[118,2,118,3],[119,2,119,3],[120,2,120,3],[121,2,121,3],[122,2,122,3],[123,2,123,3],[124,2,124,3],[1,2,1,3],[96,1,96,8],[15,12,15,13],[19,1,19,8],[2,1,2,16],[135,7,135,9],[0,1,0,14],[92,6,92,7],[93,5,93,7],[94,5,94,7],[128,4,128,6],[123,7,123,9],[124,7,124,9],[125,4,125,6],[126,4,126,6],[127,4,127,6],[117,7,117,9],[118,7,118,9],[120,7,120,9],[121,7,121,9],[122,7,122,9],[135,2,135,3],[116,1,116,10],[136,2,136,3],[137,2,137,3],[130,2,130,3],[131,2,131,3],[132,2,132,3],[133,2,133,3],[134,2,134,3],[125,2,125,3],[126,2,126,3],[127,2,127,3],[128,2,128,3],[129,2,129,3],[135,4,135,6],[136,4,136,6]]}
[null,"S/V BEATRIX - STANDING RIGGING WORKSHEET",null,null,null,null,null,null,null,null,null,null,null,null,null,null,null,null,"HIDDEN","HIDDEN","HIDDEN","HIDDEN","HIDDEN","HIDDEN","HIDDEN","HIDDEN","HIDDEN","HIDDEN","HIDDEN","HIDDEN","HIDDEN","HIDDEN","HIDDEN","HIDDEN","HIDDEN","HIDDEN","HIDDEN","HIDDEN","LAST"]
[null,null,null,null,null,null,null,null,null,null,null,null,null,null,null,null,null,null,"Supplier Column Index =",4]
[null,{"$f":"CONCATENATE(\"RIG TYPE: \",\" 2-SPREADER \",UPPER(current_saved_config_type),\" - \",VLOOKUP(current_config_lookup_value,save_meta,2))","v":"RIG TYPE:  2-SPREADER DISCONTINUOUS RIGGING - All Hi-Mod 10mm-Compact Strand V1 Swaged forestay"},null,null,null,null,null,null,null,null,null,null,null,null,null,null,null,null,"Rigging Type Selection =","Discontinuous Rigging"]
[null,"Item","Quantity ","Wire\nSize","Length \n(m)","Pin (Eye)\nSize","Top\nTerminal","Cost","Bottom Terminal","Cost","Top Toggle","Cost","Bottom Toggle","Cost","Fitting Cost","Wire Cost (w/GST)","Fitting + Wire Cost",null,"Top Toggle File","Top Terminal File","Bottom Terminal File","Bottom Toggle File","Wire Length","TYPE",null,"TYPE VAL","QTY","LABEL1","LABEL2","LABEL3","LABEL4"]
[null,"Discontinuous Cap Shroud: D3 + V2 (top seg)",2,"10mm",10.199999999999999,"5/8\"","58CTEM10",{"$f":"IF(ISNA(VLOOKUP(G5,components,colndx,FALSE)),0,VLOOKUP(G5,components,colndx,FALSE))","v":92.33},"58CTEM10",{"$f":"IF(ISNA(VLOOKUP(I5,components,colndx,FALSE)),0,VLOOKUP(I5,components,colndx,FALSE))","v":92.33},"",{"$f":"IF(ISNA(VLOOKUP(K5,components,colndx,FALSE)),0,VLOOKUP(K5,components,colndx,FALSE))","v":0},"",{"$f":"IF(ISNA(VLOOKUP(M5,components,colndx,FALSE)),0,VLOOKUP(M5,components,colndx,FALSE))","v":0},{"$f":"(C5*(H5+J5+L5+N5))*Y5","v":369.32},{"$f":"IF(C5,VLOOKUP(D5,wire_cost_table,6,FALSE)*E5*C5*1.1*(1+len_margin),0)","v":164.934},{"$f":"P5+O5","v":534.25400000000002},null,{"$f":"IF(ISNA(VLOOKUP(K5,image_lookup,image_lookup_column,FALSE)),\"blank\",VLOOKUP(K5,image_lookup,image_lookup_column,FALSE))","v":"blank"},{"$f":"IF(ISNA(VLOOKUP(G5,image_lookup,image_lookup_column,FALSE)),\"blank\",VLOOKUP(G5,image_lookup,image_lookup_column,FALSE))","v":"Hi-Mod_compression_eye.jpg"},{"$f":"IF(ISNA(VLOOKUP(I5,image_lookup,image_lookup_column,FALSE)),\"blank\",SUBSTITUTE(VLOOKUP(I5,image_lookup,image_lookup_column,FALSE),\".jpg\",\"_r.jpg\"))","v":"Hi-Mod_compression_eye_r.jpg"},{"$f":"IF(ISNA(VLOOKUP(M5,image_lookup,image_lookup_column,FALSE)),\"blank\",SUBSTITUTE(VLOOKUP(M5,image_lookup,image_lookup_column,FALSE),\".jpg\",\"_r.jpg\"))","v":"blank"},{"$f":"E5*C5","v":20.399999999999999},"discontinuous",true,{"$f":"IF(Y5,1,0)","v":1},{"$f":"Z5*C5","v":2},{"$f":"VLOOKUP(K5,components,16,FALSE)","v":{"$error":"#N/A"}},{"$f":"VLOOKUP(G5,components,16,FALSE)","v":"Hi-Mod Comp Eye 10mm Wire x 5/8\" Pin    "},{"$f":"VLOOKUP(I5,components,16,FALSE)","v":"Hi-Mod Comp Eye 10mm Wire x 5/8\" Pin    "},{"$f":"VLOOKUP(M5,components,16,FALSE)","v":{"$error":"#N/A"}},{"$f":"C5","v":2},{"$f":"D5","v":"10mm"},{"$f":"E5","v":10.199999999999999},{"$f":"F5","v":"5/8\""},{"$f":"G5","v":"58CTEM10"},{"$f":"I5","v":"58CTEM10"},{"$f":"K5","v":""},{"$f":"M5","v":""}]
[null,"Discontinuous Cap Shroud: V1 (bottom seg)",2,"10mm-D",5.5,"5/8\"","58CTEM10-D",92.33,"58CTSM10-D",92.406999999999982,"",0,"",0,{"$f":"(C6*(H6+J6+L6+N6))*Y6","v":369.47399999999993},235.83656250000004,{"$f":"P6+O6","v":605.31056249999995},null,"blank","Hi-Mod_compression_eye.jpg","Hi-Mod_compresion_stud_r.jpg ","blank",{"$f":"E6*C6","v":11},"discontinuous",true,{"$f":"IF(Y6,1,0)","v":1},{"$f":"Z6*C6","v":2},{"$error":"#N/A"},"Hi-Mod Comp Eye 10mm Dyform Wire x 5/8\" Pin    ","Hi-Mod Comp Stud 10mm Dyform Wire x 5/8-18 Thd ",{"$error":"#N/A"},2,"10mm-D",5.5,"5/8\"","58CTEM10-D","58CTSM10-D","",""]
[null,"Continuous Top Shroud",0,"10mm",15.7,"5/8\"","58CTEM10",92.33,"58CTSM10",92.406999999999982,"",0,"",0,{"$f":"(C7*(H7+J7+L7+N7))*Y7","v":0},0,0,null,"blank","Hi-Mod_compression_eye.jpg","Hi-Mod_compresion_stud_r.jpg ","blank",{"$f":"E7*C7","v":0},"continuous",false,0,0,{"$error":"#N/A"},"Hi-Mod Comp Eye 10mm Wire x 5/8\" Pin    ","Hi-Mod Comp Stud 10mm Wire x 5/8-18 Thd ",{"$error":"#N/A"},0,"10mm",15.7,"5/8\"","58CTEM10","58CTSM10","",""]
[null,"Discontinuous Intermediate D2",2,"8mm",4,"5/8\"","58CTEM08",69.845999999999989,"58CTSM08",69.902000000000001,"",0,"",0,{"$f":"(C8*(H8+J8+L8+N8))*Y8","v":279.49599999999998},50.820000000000007,330.31599999999997,null,"blank","Hi-Mod_compression_eye.jpg","Hi-Mod_compresion_stud_r.jpg ","blank",8,"discontinuous",true,1,2,{"$error":"#N/A"},"Hi-Mod Comp Eye 8mm Wire x 5/8\" Pin    ","Hi-Mod Comp Stud 8mm Wire x 5/8-18 Thd ",{"$error":"#N/A"},2,"8mm",4,"5/8\"","58CTEM08","58CTSM08","",""]
[null,"Continuous Intermediate Shroud",0,"8mm",9.5,"5/8\"","58CTEM08",69.845999999999989,"58CTSM08",69.902000000000001,"",0,"",0,{"$f":"AA9*(H9+J9+L9+N9)","v":0},0,0,null,"blank","Hi-Mod_compression_eye.jpg","Hi-Mod_compresion_stud_r.jpg ","blank",{"$f":"E9*C9","v":0},"continuous",false,0,0,{"$error":"#N/A"},"Hi-Mod Comp Eye 8mm Wire x 5/8\" Pin    ","Hi-Mod Comp Stud 8mm Wire x 5/8-18 Thd ",{"$error":"#N/A"},0,"8mm",9.5,"5/8\"","58CTEM08","58CTSM08","",""]
[null,"Lower Shrouds D1",4,"8mm",5.2,"5/8\"","58CTEM08",69.845999999999989,"58CTSM08",69.902000000000001,"",0,"",0,558.99199999999996,132.13200000000003,691.12400000000002,null,"blank","Hi-Mod_compression_eye.jpg","Hi-Mod_compresion_stud_r.jpg ","blank",20.8,"both",true,1,4,{"$error":"#N/A"},"Hi-Mod Comp Eye 8mm Wire x 5/8\" Pin    ","Hi-Mod Comp Stud 8mm Wire x 5/8-18 Thd ",{"$error":"#N/A"},4,"8mm",5.2,"5/8\"","58CTEM08","58CTSM08","",""]
[null,"Jibstay",1,"10mm",15.9,"5/8\"","58CTEM10",92.33,"58CTSM10",92.406999999999982,"FT-20C",52.24,"58EFBJ",84.301000000000002,321.27799999999996,128.5515,449.82949999999994,null,"eye_jaw_toggle.jpg ","Hi-Mod_compression_eye.jpg","Hi-Mod_compresion_stud_r.jpg ","jaw_body_tfb_eye_r.jpg",15.9,"both",true,1,1,"Alex. Roberts Eye Jaw Fixed Toggle 5/8\"","Hi-Mod Comp Eye 10mm Wire x 5/8\" Pin    ","Hi-Mod Comp Stud 10mm Wire x 5/8-18 Thd ","LH Eye Toggle & Body TFB 5/8\" Jaw 5/8\" Pin   ",1,"10mm",15.9,"5/8\"","58CTEM10","58CTSM10","FT-20C","58EFBJ"]
[null,"Backstay (Dynex Dux) rope",1,"11mm",16.559999999999999,"5/8\"","CSS72BLK",48.19,"CSS72BLK",48.19,"",0,"",0,96.38,369.62713141199998,466.00713141199998,null,"blank","Terminator.jpg","Terminator_r.jpg","blank",16.559999999999999,"both",true,1,1,{"$error":"#N/A"},"Colligo Dux Terminals 11mm x 5/8\" pin","Colligo Dux Terminals 11mm x 5/8\" pin",{"$error":"#N/A"},1,"11mm",16.559999999999999,"5/8\"","CSS72BLK","CSS72BLK","",""]
[null,"Backstay (wire)",0,"10mm",16.5,"5/8\"","58CTEM10",92.33,"58CTEM10",92.33,"FT-20C",52.24,"",0,0,{"$f":"IF(C13,VLOOKUP(D13,wire_cost_table,6,FALSE)*E13*C13*(1+len_margin),0)","v":0},{"$f":"P13+O13","v":0},null,"eye_jaw_toggle.jpg ","Hi-Mod_compression_eye.jpg","Hi-Mod_compression_eye_r.jpg","blank",0,"both",true,1,0,"Alex. Roberts Eye Jaw Fixed Toggle 5/8\"","Hi-Mod Comp Eye 10mm Wire x 5/8\" Pin    ","Hi-Mod Comp Eye 10mm Wire x 5/8\" Pin    ",{"$error":"#N/A"},0,"10mm",16.5,"5/8\"","58CTEM10","58CTEM10","FT-20C",""]
[null,"Forestay (staysail stay)",1,"8mm",10.6,"1/2\"","58RCSEM08",30.723000000000003,"58RCSSM08",34.584000000000003,"",0,"",0,65.307000000000002,{"$f":"IF(C14,VLOOKUP(D14,wire_cost_table,6,FALSE)*E14*C14*(1+len_margin),0)","v":61.214999999999996},126.52199999999999,null,"blank","N546-eye-swage-terminal.jpg ","rigging_stud_r.jpg","blank",10.6,"both",true,1,1,{"$error":"#N/A"},"Rope & Cable Eye + Swaging 8mm wire x 5/8 eye","Rope & Cable Thd Stud + Swaging 8mm wire x 5/8-18 RH thd",{"$error":"#N/A"},1,"8mm",10.6,"1/2\"","58RCSEM08","58RCSSM08","",""]
[null,"Insulators (pair)",0,"10mm",null,"n/a","CTICCM10",374.17099999999994,"CTICCM10",374.17099999999994,"",0,"",0,0,{"$f":"IF(C15,VLOOKUP(D15,wire_cost_table,6,FALSE)*E15*C15*(1+len_margin),0)","v":0},0,null,"blank","insulator.jpg","insulator_r.jpg","blank",0,"both",true,1,0,{"$error":"#N/A"},"Hi-Mod Insulator Comp/Comp 10mm Wire    ","Hi-Mod Insulator Comp/Comp 10mm Wire    ",{"$error":"#N/A"},0,"10mm",0,"n/a","CTICCM10","CTICCM10","",""]
[null,"TOTAL ITEMS",{"$f":"SUM(C5:C15)","v":13},null,null,null,null,null,null,null,null,null,"TOTAL  COST",null,{"$f":"SUM(O5:O15)","v":2060.2469999999994},{"$f":"SUM(P5:P15)","v":1143.116193912},3203.363193912,null,"Image Lookup Column",{"$f":"ROW()-1","v":15}]
[null,null,null,null,null,null,null,null,null,null,null,null,null,null,null,null,null,null,"Start Row for Saved Data",{"$f":"VLOOKUP((current_config_lookup_value),save_meta,5,FALSE)","v":110}]
[null,"Forestay (staysail stay) (8mm wire)",null,null,null,null,null,null,null,null,null,null,null,null,null,null,null,null,"Current Config","8 - Discontinuous Rigging All Hi-Mod 10mm-Compact Strand V1 Swaged forestay"]
[null,null,null,null,null,null,null,null,null,null,null,null,null,null,null,null,null,null,"Current Config Lookup Value",{"$f":"VALUE(TRIM(LEFT(current_config,2)))","v":8}]
[null,{"$f":"CONCATENATE(\"RIGGING COMPONENTS \",\" - \",VLOOKUP(current_config_lookup_value,save_meta,2))","v":"RIGGING COMPONENTS  - All Hi-Mod 10mm-Compact Strand V1 Swaged forestay"},null,null,null,null,null,null,null,null,null,null,null,null,null,null,null,null,"Current Config Name",{"$f":"VLOOKUP(current_config_lookup_value,save_meta,2)","v":"All Hi-Mod 10mm-Compact Strand V1 Swaged forestay"}]
[null,"Fittings for 1x19 SS Wire","Wire","Eye or Stud Size","Mfg #","Quantity","FISCO SKU","Cost","Total Cost",null,null,null,null,null,null,null,null,null,"IMAGE FILES","LABELS"]
[null,{"$f":"VLOOKUP(E22,hayn_catalog,2,FALSE)","v":"Hi-Mod Comp Stud 8mm Wire x 1/2-20 Thd "},"8mm","1/2\"","12CTSM08",{"$f":"SUMIF(topterm,E22,qty)+SUMIF(bottomterm,E22,qty)+SUMIF(toptog,E22,qty)+SUMIF(bottomtog,E22,qty)","v":0},null,{"$f":"VLOOKUP(E22,hayn_catalog,5,FALSE)","v":68.347999999999999},{"$f":"F22*H22","v":0},null,null,null,null,null,null,null,null,null,"Hi-Mod_compresion_stud.jpg ",{"$f":"B22","v":"Hi-Mod Comp Stud 8mm Wire x 1/2-20 Thd "}]
[null,"Hi-Mod Comp Eye 8mm Wire x 1/2\" Pin    ","10mm ","5/8\"","12CTEM08",{"$f":"SUMIF(topterm,E23,qty)+SUMIF(bottomterm,E23,qty)+SUMIF(toptog,E23,qty)+SUMIF(bottomtog,E23,qty)","v":0},158813,{"$f":"VLOOKUP(E23,hayn_catalog,5,FALSE)","v":68.802999999999997},{"$f":"F23*H23","v":0},null,null,null,null,null,null,null,null,null,"Hi-Mod_compression_eye.jpg",{"$f":"B23","v":"Hi-Mod Comp Eye 8mm Wire x 1/2\" Pin    "}]
[null,{"$f":"VLOOKUP(E24,hayn_catalog,2,FALSE)","v":"Hi-Mod Comp Stud 7/16\" Wire x 3/4-16 Thd"},"7/16\"","3/4\"","34CTS716",0,158588,205.88399999999999,0,null,null,null,null,null,null,null,null,null,"Hi-Mod_compresion_stud.jpg ","Hi-Mod Comp Stud 7/16\" Wire x 3/4-16 Thd"]
[null,"Hi-Mod Comp Stud 10mm Dyform Wire x 5/8-18 Thd ","10mm-D","5/8\"","58CTSM10-D",2,158588,92.406999999999982,184.81399999999996,null,null,null,null,null,null,null,null,null,"Hi-Mod_compresion_stud.jpg ","Hi-Mod Comp Stud 10mm Dyform Wire x 5/8-18 Thd "]
[null,{"$f":"VLOOKUP(E26,hayn_catalog,2,FALSE)","v":"Hi-Mod Comp Eye 10mm Dyform Wire x 5/8\" Pin    "},"10mm ","5/8\"","58CTEM10-D",{"$f":"SUMIF(topterm,E26,qty)+SUMIF(bottomterm,E26,qty)+SUMIF(toptog,E26,qty)+SUMIF(bottomtog,E26,qty)","v":2},158813,{"$f":"VLOOKUP(E26,hayn_catalog,5,FALSE)","v":92.33},{"$f":"F26*H26","v":184.66},null,null,null,null,null,null,null,null,null,"Hi-Mod_compression_eye.jpg",{"$f":"B26","v":"Hi-Mod Comp Eye 10mm Dyform Wire x 5/8\" Pin    "}]
[null,"Hi-Mod Comp Stud 10mm Wire x 3/4-16 Thd ","10mm","3/4\"","34CTSM10",0,158587,205.88399999999999,0,null,null,null,null,null,null,null,null,null,"Hi-Mod_compresion_stud.jpg ","Hi-Mod Comp Stud 10mm Wire x 3/4-16 Thd "]
[null,"Hi-Mod Comp Stud 5/16\" Wire x 1/2\"-20 Thd","5/16\"","1/2\"","12CTS516",0,null,68.347999999999999,0,null,null,null,null,null,null,null,null,null,"Hi-Mod_compresion_stud.jpg ","Hi-Mod Comp Stud 5/16\" Wire x 1/2\"-20 Thd"]
[null,"Hi-Mod Comp Stud 10mm Wire x 5/8-18 Thd ","10mm","5/8\"","58CTSM10",1,null,92.406999999999982,92.406999999999982,null,null,null,null,null,null,null,null,null,"Hi-Mod_compresion_stud.jpg ","Hi-Mod Comp Stud 10mm Wire x 5/8-18 Thd "]
[null,"Hi-Mod Comp Stud 3/8\" Wire x 3/4-16 Thd ","3/8\"","3/4\"","34CTS38",0,null,205.88399999999999,0,null,null,null,null,null,null,null,null,null,"Hi-Mod_compresion_stud.jpg ","Hi-Mod Comp Stud 3/8\" Wire x 3/4-16 Thd "]
[null,"Hi-Mod Comp Stud 8mm Wire x 5/8-18 Thd ","8mm","5/8\"","58CTSM08",6,null,69.902000000000001,419.41200000000003,null,null,null,null,null,null,null,null,null,"Hi-Mod_compresion_stud.jpg ","Hi-Mod Comp Stud 8mm Wire x 5/8-18 Thd "]
[null,"Hi-Mod Comp Stud 10mm Wire x 3/4-16 Thd ","10mm","3/4\"","34CTSM10",0,null,205.88399999999999,0,null,null,null,null,null,null,null,null,null,"Hi-Mod_compresion_stud.jpg ","Hi-Mod Comp Stud 10mm Wire x 3/4-16 Thd "]
[null,"Threaded T-Bolt Toggle Jaw 1/2-20 LH    ","10mm","1/2\"","12TJLH",0,168055,29.448999999999998,0,null,null,null,null,null,null,null,null,null,"threaded_toggle_jaw.jpg","Threaded T-Bolt Toggle Jaw 1/2-20 LH    "]
[null,"Hi-Mod Comp Eye 3/8\" Wire x 5/8\" Pin    ","3/8\"","5/8\"","58CTE38",0,null,92.33,0,null,null,null,null,null,null,null,null,null,"Hi-Mod_compression_eye.jpg","Hi-Mod Comp Eye 3/8\" Wire x 5/8\" Pin    "]
[null,"Hi-Mod Comp Eye 5/16\" Wire x 5/8\" Pin   ","5/16\"","5/8\"","58CTE516",0,null,69.845999999999989,0,null,null,null,null,null,null,null,null,null,"Hi-Mod_compression_eye.jpg","Hi-Mod Comp Eye 5/16\" Wire x 5/8\" Pin   "]
[null,"Hi-Mod Comp Eye 8mm Wire x 5/8\" Pin    ","8mm","5/8\"","58CTEM08",6,null,69.845999999999989,419.07599999999991,null,null,null,null,null,null,null,null,null,"Hi-Mod_compression_eye.jpg","Hi-Mod Comp Eye 8mm Wire x 5/8\" Pin    "]
[null,"Hi-Mod Comp Eye 10mm Wire x 5/8\" Pin    ","10mm","5/8\"","58CTEM10",5,null,92.33,461.65,null,null,null,null,null,null,null,null,null,"Hi-Mod_compression_eye.jpg","Hi-Mod Comp Eye 10mm Wire x 5/8\" Pin    "]
[null,"Hi-Mod Comp Eye 7/16\" Wire x 3/4\" Pin   ","7/16\"","5/8\"","34CTE716",0,158813,212.75799999999998,0,null,null,null,null,null,null,null,null,null,"Hi-Mod_compression_eye.jpg","Hi-Mod Comp Eye 7/16\" Wire x 3/4\" Pin   "]
[null,"Hi-Mod Comp Fork 5/16\" Wire x 5/8\" Pin  ","5/16\"","5/8\"","58CTF516",0,null,80.282999999999987,0,null,null,null,null,null,null,null,null,null,"Hi-Mod_compression_fork.jpg","Hi-Mod Comp Fork 5/16\" Wire x 5/8\" Pin  "]
[null,"Hi-Mod Comp Fork 3/8\" Wire x 5/8\" Pin   ","3/8\"","5/8\"","58CTF38",0,null,108.38799999999999,0,null,null,null,null,null,null,null,null,null,"Hi-Mod_compression_fork.jpg","Hi-Mod Comp Fork 3/8\" Wire x 5/8\" Pin   "]
[null,"Hi-Mod Comp Fork 8mm Wire x 5/8\" Pin  ","5/16\"","5/8\"","58CTFM08",0,null,80.282999999999987,0,null,null,null,null,null,null,null,null,null,"Hi-Mod_compression_fork.jpg","Hi-Mod Comp Fork 8mm Wire x 5/8\" Pin  "]
[null,{"$f":"VLOOKUP(E42,hayn_catalog,2,FALSE)","v":"Hi-Mod Comp Fork 10mm Wire x 5/8\" Pin  "},"5/16\"","5/8\"","58CTFM10",0,null,108.38799999999999,0,null,null,null,null,null,null,null,null,null,"Hi-Mod_compression_fork.jpg","Hi-Mod Comp Fork 10mm Wire x 5/8\" Pin  "]
[null,"Hi-Mod Comp Fork 10mm Dyform Wire x 5/8\" Pin  ","10mm","5/8\"","58CTFM10-D",0,null,108.38799999999999,0,null,null,null,null,null,null,null,null,null,"Hi-Mod_compression_fork.jpg","Hi-Mod Comp Fork 10mm Dyform Wire x 5/8\" Pin  "]
[null,"Hi-Mod Comp Fork 7/16\" Wire x 3/4\" Pin  ","5/16\"","5/8\"","34CTF716",0,null,256.87199999999996,0,null,null,null,null,null,null,null,null,null,"Hi-Mod_compression_fork.jpg","Hi-Mod Comp Fork 7/16\" Wire x 3/4\" Pin  "]
[null,"LH Eye Toggle & Body TFB 5/8\" Jaw 5/8\" Pin   ",null,"5/8\"","58EFBJ",1,158595,84.301000000000002,84.301000000000002,null,null,null,null,null,null,null,null,null,"jaw_body_tfb_eye.jpg","LH Eye Toggle & Body TFB 5/8\" Jaw 5/8\" Pin   "]
[null,"LH Jaw and Body FBJ 5/8\"Jaw 5/8\" Pin     ",null,"5/8\"","58FBJ",0,158595,98.301000000000002,0,null,null,null,null,null,null,null,null,null,"partial_turnbuckle.jpg","LH Jaw and Body FBJ 5/8\"Jaw 5/8\" Pin     "]
[null,"LH Eye Toggle & Body TFB 3/4\" Jaw 3/4\" Pin   ",null,"3/4\"","34EFBJ",0,219199,201.97800000000001,0,null,null,null,null,null,null,null,null,null,"jaw_body_tfb_eye.jpg","LH Eye Toggle & Body TFB 3/4\" Jaw 3/4\" Pin   "]
[null,"LH Jaw and Body FBJ 3/4\"Jaw 3/4\" Pin     ",null,"3/4\"","34FBJ",0,158594,148.52599999999998,0,null,null,null,null,null,null,null,null,null,"partial_turnbuckle.jpg","LH Jaw and Body FBJ 3/4\"Jaw 3/4\" Pin     "]
[null,"Threaded T-Bolt Toggle Jaw 5/8-18 LH    ",null,"5/8\"","58TJLH",0,168132,46.192999999999991,0,null,null,null,null,null,null,null,null,null,"threaded_toggle_jaw.jpg","Threaded T-Bolt Toggle Jaw 5/8-18 LH    "]
[null,"Threaded T-Bolt Toggle Jaw 3/4-16 LH    ",null,"3/4\"","34TJLH",0,null,112.96599999999999,0,null,null,null,null,null,null,null,null,null,"threaded_toggle_jaw.jpg","Threaded T-Bolt Toggle Jaw 3/4-16 LH    "]
[null,"Marine Eye 7/16\" Wire - 3/4\" Pin        ","7/16\"","3/4\"","ME14",0,null,48.405000000000001,0,null,null,null,null,null,null,null,null,null,"marine_eye.jpg","Marine Eye 7/16\" Wire - 3/4\" Pin        "]
[null,"Marine Eye 8mm Wire - 5/8\" Pin","8mm","5/8\"","MEM08",0,null,22.82,0,null,null,null,null,null,null,null,null,null,"marine_eye.jpg","Marine Eye 8mm Wire - 5/8\" Pin"]
[null,{"$f":"VLOOKUP(E53,hayn_catalog,2,FALSE)","v":"Marine Eye 10mm Wire - 5/8\" Pin"},"10mm","5/8\"","MEM10",0,null,26.760999999999996,0,null,null,null,null,null,null,null,null,null,"marine_eye.jpg","Marine Eye 10mm Wire - 5/8\" Pin"]
[null,"Rigging Toggle Jaw ME 3/8\"Wire 5/8\"Pin  ","3/8\"","5/8\"","58RT38",0,null,61.011999999999993,0,null,null,null,null,null,null,null,null,null,"marine_eye_toggle_jaw.jpg","Rigging Toggle Jaw ME 3/8\"Wire 5/8\"Pin  "]
[null,{"$f":"VLOOKUP(E55,hayn_catalog,2,FALSE)","v":"Rigging Toggle Jaw ME 5/16\"Wire 5/8\"Pin "},"5/16\"","5/8\"","58RT516",{"$f":"SUMIF(topterm,E55,qty)+SUMIF(bottomterm,E55,qty)+SUMIF(toptog,E55,qty)+SUMIF(bottomtog,E55,qty)","v":0},null,48.894999999999996,{"$f":"F55*H55","v":0},null,null,null,null,null,null,null,null,null,"marine_eye_toggle_jaw.jpg",{"$f":"B55","v":"Rigging Toggle Jaw ME 5/16\"Wire 5/8\"Pin "}]
[null,{"$f":"VLOOKUP(E56,hayn_catalog,2,FALSE)","v":"Rigging Toggle Jaw ME 7/16\"Wire 3/4\"Pin "},"7/16\"","1/2\" pin","34RT716",0,null,104.36999999999999,0,null,null,null,null,null,null,null,null,null,"marine_eye_toggle_jaw.jpg","Rigging Toggle Jaw ME 7/16\"Wire 3/4\"Pin "]
[null,{"$f":"VLOOKUP(E57,hayn_catalog,2,FALSE)","v":"Rigging Toggle Jaw ME 8mm Wire 5/8\"Pin "},"8mm","5/8\"","58RTM08",0,null,48.894999999999996,0,null,null,null,null,null,null,null,null,null,"marine_eye_toggle_jaw.jpg","Rigging Toggle Jaw ME 8mm Wire 5/8\"Pin "]
[null,"Rigging Toggle Jaw ME 10mm Wire 5/8\"Pin  ","10mm","5/8\"","58RTM10",0,null,61.011999999999993,0,null,null,null,null,null,null,null,null,null,"marine_eye_toggle_jaw.jpg","Rigging Toggle Jaw ME 10mm Wire 5/8\"Pin  "]
[null,"Stud Rigging 10mm Wire 5/8-18 X 4 RH     ","10mm","5/8\"","58SEM10RH",0,null,30.946999999999999,0,null,null,null,null,null,null,null,null,null,"rigging_stud.jpg","Stud Rigging 10mm Wire 5/8-18 X 4 RH     "]
[null,"Stud Rigging 8mm Wire 5/8-18 X 4 RH    ","8mm","5/8\"","58SEM08RH",0,null,24.773,0,null,null,null,null,null,null,null,null,null,"rigging_stud.jpg","Stud Rigging 8mm Wire 5/8-18 X 4 RH    "]
[null,{"$f":"VLOOKUP(E61,hayn_catalog,2,FALSE)","v":"Stud Rigging 8mm Wire 1/2-20 X 3 1/4 RH"},"8mm","1/2\"","12SEM08RH",0,null,23.309999999999995,0,null,null,null,null,null,null,null,null,null,"rigging_stud.jpg","Stud Rigging 8mm Wire 1/2-20 X 3 1/4 RH"]
[null,{"$f":"VLOOKUP(E62,hayn_catalog,2,FALSE)","v":"Stud Rigging 7/16\" Wire 3/4-16 X 5 RH    "},"7/16\"","3/4\"","34SE716RH",0,null,47.061,0,null,null,null,null,null,null,null,null,null,"rigging_stud.jpg","Stud Rigging 7/16\" Wire 3/4-16 X 5 RH    "]
[null,"Schaeffer Double Jaw Toggles",null,"1/2\" pin","93-87",0,23328,67.98,0,null,null,null,null,null,null,null,null,null,"schaeffer_doublejaw_toggle.jpg","Schaeffer Double Jaw Toggles"]
[null,"Schaeffer Double Jaw Toggles",null,"5/8\" pin","93-88",0,10216,94.75,0,null,null,null,null,null,null,null,null,null,"schaeffer_doublejaw_toggle.jpg","Schaeffer Double Jaw Toggles"]
[null,"Colligo Dux Terminal 9mm","9mm","5/8\"","CSS71BLK",0,null,50,0,null,null,null,null,null,null,null,null,null,"Terminator.jpg","Colligo Dux Terminal 9mm"]
[null,"Colligo Dux Terminals 11mm x 5/8\" pin","11mm x 5/8\" pin","5/8\"","CSS72BLK",2,null,48.19,96.38,null,null,null,null,null,null,null,null,null,"Terminator.jpg","Colligo Dux Terminals 11mm x 5/8\" pin"]
[null,{"$f":"VLOOKUP(E67,hayn_catalog,2,FALSE)","v":"Hi-Mod Insulator Comp/Comp 3/8\" Wire    "},"3/8\"",null,"CTICC38",0,null,{"$f":"VLOOKUP(E67,hayn_catalog,5,FALSE)","v":374.17099999999994},0,null,null,null,null,null,null,null,null,null,"insulator.jpg","Hi-Mod Insulator Comp/Comp 3/8\" Wire    "]
[null,{"$f":"VLOOKUP(E68,hayn_catalog,2,FALSE)","v":"Hi-Mod Insulator Comp/Comp 10mm Wire    "},"10mm",null,"CTICCM10",0,null,{"$f":"VLOOKUP(E68,hayn_catalog,5,FALSE)","v":374.17099999999994},0,null,null,null,null,null,null,null,null,null,"insulator.jpg","Hi-Mod Insulator Comp/Comp 10mm Wire    "]
[null,"Alex. Roberts Eye Jaw Fixed Toggle 1/2\"",null,"1/2\"","FT-16C",0,"00883",30.58,0,null,null,null,null,null,null,null,null,null,"eye_jaw_toggle.jpg ","Alex. Roberts Eye Jaw Fixed Toggle 1/2\""]
[null,"Alex. Roberts Eye Jaw Fixed Toggle 5/8\"",null,"5/8\"","FT-20C",1,"01011",52.24,52.24,null,null,null,null,null,null,null,null,null,"eye_jaw_toggle.jpg ","Alex. Roberts Eye Jaw Fixed Toggle 5/8\""]
[null,"SecoSouth Swage Eye Terminal 5/16\" wire x eye","5/16\"","5/8\"","N546-1020",0,null,23.45,0,null,null,null,null,null,null,null,null,null,"N546-eye-swage-terminal.jpg ","SecoSouth Swage Eye Terminal 5/16\" wire x eye"]
[null,"SecoSouth Swage Eye Terminal 3/8\" wire x 5/8 eye","3/8\"","5/8\"","N546-1220",0,null,23.45,0,null,null,null,null,null,null,null,null,null,"N546-eye-swage-terminal.jpg ","SecoSouth Swage Eye Terminal 3/8\" wire x 5/8 eye"]
[null,"Rope & Cable Eye + Swaging 10mm wire x 5/8 eye","10mm","5/8\"","58RCSEM10",0,null,{"$f":"(41.3 + 10 )*1.1","v":56.43},0,null,null,null,null,null,null,null,null,null,"N546-eye-swage-terminal.jpg ","Rope & Cable Eye + Swaging 10mm wire x 5/8 eye"]
[null,"Rope & Cable Eye + Swaging 8mm wire x 5/8 eye","8mm","5/8\"","58RCSEM08",1,null,{"$f":"(19.93 + 8)*1.1","v":30.723000000000003},30.723000000000003,null,null,null,null,null,null,null,null,null,"N546-eye-swage-terminal.jpg ","Rope & Cable Eye + Swaging 8mm wire x 5/8 eye"]
[null,"Rope & Cable Eye + Swaging 10mm wire x 3/4\" eye","10mm","3/4\"","34RCSEM10",0,null,{"$f":"43.93*1.1","v":48.323},0,null,null,null,null,null,null,null,null,null,"N546-eye-swage-terminal.jpg ","Rope & Cable Eye + Swaging 10mm wire x 3/4\" eye"]
[null,"Rope & Cable Eye + Swaging 7/16 wire x 3/4 eye","7/16\"","3/4\"","34RCSE716",0,null,49.3,0,null,null,null,null,null,null,null,null,null,"N546-eye-swage-terminal.jpg ","Rope & Cable Eye + Swaging 7/16 wire x 3/4 eye"]
[null,"Rope & Cable Thd Stud + Swaging 10mm wire x 5/8-18 RH thd","10mm","5/8\"","58RCSSM10",0,null,{"$f":"36.83*1.1","v":40.512999999999998},0,null,null,null,null,null,null,null,null,null,"rigging_stud.jpg","Rope & Cable Thd Stud + Swaging 10mm wire x 5/8-18 RH thd"]
[null,"Rope & Cable Thd Stud + Swaging 8mm wire x 5/8-18 RH thd","8mm","5/8\"","58RCSSM08",1,null,{"$f":"31.44*1.1","v":34.584000000000003},34.584000000000003,null,null,null,null,null,null,null,null,null,"rigging_stud.jpg","Rope & Cable Thd Stud + Swaging 8mm wire x 5/8-18 RH thd"]
[null,"Rope & Cable Thd Stud + Swaging 10mm wire x 3/4-16 RH thd","10mm","3/4\"","34RCSSM10",0,null,{"$f":"45.83*1.1","v":50.413000000000004},0,null,null,null,null,null,null,null,null,null,"rigging_stud.jpg","Rope & Cable Thd Stud + Swaging 10mm wire x 3/4-16 RH thd"]
[null,"Rope & Cable Thd Stud + Swaging 7/16 wire x 3/4-16 RH thd","7/16\"","3/4\"","34RCSS716",0,null,55,0,null,null,null,null,null,null,null,null,null,"rigging_stud.jpg","Rope & Cable Thd Stud + Swaging 7/16 wire x 3/4-16 RH thd"]
[null,"Alex. Roberts Threaded Toggle Jaw LH 1/2\"",null,"1/2\"","TBT-1616",0,null,null,0,null,null,null,null,null,null,null,null,null,"threaded_toggle_jaw.jpg","Alex. Roberts Threaded Toggle Jaw LH 1/2\""]
[null,"Alex. Roberts Threaded Toggle Jaw LH 5/8\"",null,"5/8\"","TBT-2020",0,null,null,0,null,null,null,null,null,null,null,null,null,"threaded_toggle_jaw.jpg","Alex. Roberts Threaded Toggle Jaw LH 5/8\""]
[null,{"$f":"VLOOKUP(E83,hayn_catalog,2,FALSE)","v":"Toggle, Eye-Jaw 1/2\" Pin                "},null,"1/2\"","TOG07",0,168103,{"$f":"VLOOKUP(E83,hayn_catalog,5,FALSE)","v":44.778999999999996},0,null,null,null,null,null,null,null,null,null,"Hi-Mod_eye_jaw_toggle.jpg ","Toggle, Eye-Jaw 1/2\" Pin                "]
[null,{"$f":"VLOOKUP(E84,hayn_catalog,2,FALSE)","v":"Toggle, Eye-Jaw 5/8\" Pin                "},null,"5/8\"","TOG10",0,168104,{"$f":"VLOOKUP(E84,hayn_catalog,5,FALSE)","v":107.38699999999999},0,null,null,null,null,null,null,null,null,null,"Hi-Mod_eye_jaw_toggle.jpg ","Toggle, Eye-Jaw 5/8\" Pin                "]
[null,{"$f":"VLOOKUP(E85,hayn_catalog,2,FALSE)","v":"Hi-Mod Comp Extender 7/16\" Wire         "},null,"7/16\"","CTX716",0,null,{"$f":"VLOOKUP(E85,hayn_catalog,5,FALSE)","v":46.339999999999996},0,null,null,null,null,null,null,null,null,null,"extender.jpg","Hi-Mod Comp Extender 7/16\" Wire         "]
[null,{"$f":"VLOOKUP(E86,hayn_catalog,2,FALSE)","v":"Hi-Mod Comp Extender 10mm Wire          "},null,"10mm","CTXM10",0,null,{"$f":"VLOOKUP(E86,hayn_catalog,5,FALSE)","v":46.339999999999996},0,null,null,null,null,null,null,null,null,null,"extender.jpg","Hi-Mod Comp Extender 10mm Wire          "]
[null,{"$f":"VLOOKUP(E87,hayn_catalog,2,FALSE)","v":"Hi-Mod Comp Extender 5/16\" Wire         "},null,"8mm","CTX516",{"$f":"SUMIF(topterm,E87,qty)+SUMIF(bottomterm,E87,qty)+SUMIF(toptog,E87,qty)+SUMIF(bottomtog,E87,qty)","v":0},183838,{"$f":"VLOOKUP(E87,hayn_catalog,5,FALSE)","v":33.284999999999997},{"$f":"F87*H87","v":0},null,null,null,null,null,null,null,null,null,"extender.jpg",{"$f":"B87","v":"Hi-Mod Comp Extender 5/16\" Wire         "}]
[null,"Clevis Pin",null,"5/8\"","193606-1",null,85948,3.01,0,null,null,null,null,null,null,null,null,null,"clevis_pin.jpg","Clevis Pin"]
[null,"Clevis Pin",null,"3/4\"",193608,null,77258,3.44,0,null,null,null,null,null,null,null,null,null,"clevis_pin.jpg","Clevis Pin"]
[null,"Spreader Boot (Nylon, upper only)",null,null,"SBTU",null,53965,24.52,0,null,null,null,null,null,null,null,null,null,"blank.jpg","Spreader Boot (Nylon, upper only)"]
[null,"Spreader Boot Tip (Leather 6.75\" circumf)",null,null,"SBT small",null,130294,40,0,null,null,null,null,null,null,null,null,null,"blank.jpg","Spreader Boot Tip (Leather 6.75\" circumf)"]
[null,"Spreader Boot Tip (Leather 9.5\" circumf)",null,null,"SBT large",null,130295,65,0,null,null,null,null,null,null,null,null,null,"blank.jpg","Spreader Boot Tip (Leather 9.5\" circumf)"]
[null,"Mast Height = 51' or 15.5m",null,null,null,{"$f":"SUM(F27:F92)","v":24},"TOTALS",null,{"$f":"SUM(I25:I92)","v":2060.2469999999998}]
[null,null,null,null,null,{"$f":"CONCATENATE(\"USA Shipping (\",USPS_FRB,\" boxes)\")","v":"USA Shipping (4 boxes)"},null,null,{"$f":"USPS_FRB*47.95","v":191.8}]
[null,null,null,null,null,"Total",null,null,{"$f":"I94+I93","v":2252.047},null,null,null,null,null,null,null,null,null,"USPS Shipping Boxes"]
[null,"Add Wire Length Margin of ",0.05,null,null,null,null,null,null,null,null,null,null,null,null,null,null,null,{"$f":"IF(C13=1,0,1)+ROUNDUP(I93/1000,0)","v":4}]
[null,"WIRE SPECIFICATIONS"]
[null,null,"Wire Size","Length (m)\n(round)","Breaking Strength (kg)","Weight\n(kg/100m)","Weight\n(kg)","Price per Meter*","Cost w/GST"]
[null,"316 1x19","7mm",{"$f":"ROUNDUP(SUMIF(elem_wire_sz,C99,tot_wire_len)*(1+len_margin),0)","v":0},3550,23.9,{"$f":"F99*D99/100","v":0},4.5,{"$f":"H99*D99*1.1","v":0},null,null,"price unconfirmed",null,null,null,null,null,null,"lbs/kilo",0.4536]
[null,"316 1x19","8mm",{"$f":"ROUNDUP(SUMIF(elem_wire_sz,C100,tot_wire_len)*(1+len_margin),0)","v":42},5745,31.7,{"$f":"F100*D100/100","v":13.313999999999998},5.5,{"$f":"H100*D100*1.1","v":254.10000000000002},null,null,null,null,null,null,null,null,null,"lbs/kilo",0.4536]
[null,"316 1x19","5/16\"",{"$f":"SUMIF(elem_wire_sz,C101,tot_wire_len)","v":0},5745,31.7,0,5.5,{"$f":"H101*D101","v":0},null,null,null,null,null,null,null,null,null,"m/ft",0.30480000000000002]
[null,"316 Compact Strand","10mm-D",{"$f":"ROUNDUP(SUMIF(elem_wire_sz,C102,tot_wire_len)*(1+len_margin),0)","v":12},9800,49.5,{"$f":"F102*D102/100","v":5.94},{"$f":"24.75*0.75","v":18.5625},{"$f":"H102*D102*1.1","v":245.02500000000001}]
[null,"316 1x19","10mm",{"$f":"ROUNDUP(SUMIF(elem_wire_sz,C103,tot_wire_len)*(1+len_margin),0)","v":39},8415,49.5,19.305,7,{"$f":"H103*D103*1.1","v":300.3},null,null,null,null,null,null,null,null,null,"kg/100' conversion",{"$f":"1/T101*T100","v":1.4881889763779526}]
[null,"316 1x19","7/16\"",{"$f":"ROUNDUP(SUMIF(elem_wire_sz,C104,tot_wire_len)*(1+len_margin),0)","v":0},10700,59.1,0,8,{"$f":"H104*D104*1.1","v":0}]
[null,"316 1x19","3/8\"",{"$f":"SUMIF(elem_wire_sz,C105,tot_wire_len)","v":0},{"$f":"6850*1.2","v":8220},44.65,0,7,{"$f":"H105*D105","v":0},null,null,null,null,null,null,null,null,null,30,{"$f":"S105*wire_wt_conv","v":44.645669291338578}]
[null,"Colligo Dux","9mm",{"$f":"SUMIF(elem_wire_sz,C106,tot_wire_len)","v":0},12000,5.4,0,5.6,{"$f":"H106*D106","v":0},null,null,null,null,null,null,null,null,null,"lb/100'"]
[null,"Colligo Dux","11mm",{"$f":"SUMIF(elem_wire_sz,C107,tot_wire_len)","v":16.559999999999999},18400,8.3000000000000007,1.3744800000000001,{"$f":"5.89*3.281","v":19.325089999999999},{"$f":"H107*D107","v":320.02349039999996}]
[null,"TOTAL",null,{"$f":"SUM(D100:D107)","v":109.56},null,null,{"$f":"SUM(G100:G107)","v":39.933479999999996},null,{"$f":"SUM(I100:I107)","v":1119.4484903999999}]
[]
[null,"PROJECT SUMMARY","QTY / LENGTH","TOTAL"]
[null,"Parts",{"$f":"F93","v":24},{"$f":"I93","v":2060.2469999999998}]
[null,"Colligo Dux",{"$f":"SUM(D106:D107)","v":16.559999999999999},{"$f":"SUM(I106:I107)","v":320.02349039999996}]
[null,"Wire",{"$f":"SUM(D100:D105)","v":93},{"$f":"SUM(I100:I105)","v":799.42499999999995}]
[null,"Shipping",{"$f":"USPS_FRB","v":4},{"$f":"I94","v":191.8}]
[null,"TOTAL",null,{"$f":"SUM(D111:D114)","v":3371.4954903999997}]
[]
[null,"Pros and Cons of Rigging Systems"]
[null,"Item","Dynex Dux",null,"Steel Wire w/ Hi-Mods",null,null,"Steel Wire w/ Swaging",null,null,"Score Weight 1-10",null,null,null,null,null,null,null,"Dux","Hi-Mod","Swaging"]
[null,"Weight Aloft","5kg total Dux rig",null,"58kg total wire rig except for Dux backstay",null,null,"58kg total wire rig except Dux b/stay",null,null,2,null,null,null,null,null,null,null,"x","x",null,{"$f":"IF(S119=\"X\",$K119,0)","v":2},{"$f":"IF(T119=\"X\",$K119,0)","v":2},{"$f":"IF(U119=\"X\",$K119,0)","v":0}]
[null,"Inspection of Wire or Rope Ends","YES",null,"Possible with disassembly",null,null,"Not Possible",null,null,6,null,null,null,null,null,null,null,"x","x",null,{"$f":"IF(S120=\"X\",$K120,0)","v":6},{"$f":"IF(T120=\"X\",$K120,0)","v":6},{"$f":"IF(U120=\"X\",$K120,0)","v":0}]
[null,"Chafe","Needs inspection/protection",null,"Steel never chafes",null,null,"Steel never chafes",null,null,7,null,null,null,null,null,null,null,null,"x","x",0,7,7]
[null,"Rig Install time","About twice the steel time",null,"4 hours for good rigger",null,null,"4 hours for good rigger",null,null,3,null,null,null,null,null,null,null,null,"x","x",0,3,3]
[null,"Wire or Rope Cost","About the Same",null,"About the same",null,null,"About the same",null,null,4,null,null,null,null,null,null,null,"x","x","x",4,4,4]
[null,"Lifetime","5-8 years.  Results not all in.",null,"8 years (10-15 in practice)",null,null,"8 years (10-15 in practice)",null,null,6,null,null,null,null,null,null,null,null,"x","x",0,6,6]
[null,"Termination Costs","70% of Hi-Mod",null,"Hi-Mod fittings all around @ $90 each*",null,null,"Less Than Both Dynex or Hi-Mod",null,null,5,null,null,null,null,null,null,null,"x",null,"x",5,0,5]
[null,"History","New Technology",null,"Tried and True",null,null,"Tried and True",null,null,9,null,null,null,null,null,null,null,null,"x","x",0,9,9]
[null,"Failure","None at this time",null,"Never",null,null,"<100%",null,null,10,null,null,null,null,null,null,null,"x","x",null,10,10,0]
[null,"Installer (Labor Costs)","DIY",null,"DIY",null,null,"Swaging Shop or Rigger",null,null,5,null,null,null,null,null,null,null,"x","x",null,5,5,0]
[null,"Terminal Attachment Time or Splicing","Longest",null,"2-minutes plus",null,null,"Longer",null,null,3,null,null,null,null,null,null,null,null,"x",null,0,3,0]
[null,"Dynamic Loading in High Sea States**","Much Greater",null,"Normal",null,null,"Normal",null,null,3,null,null,null,null,null,null,null,null,"x","x",0,3,3]
[null,"Reusable Terminators","YES",null,"YES",null,null,"NO",null,null,7,null,null,null,null,null,null,null,"x","x",null,7,7,0]
[null,"Thermal Expansion Issue","YES",null,"NO",null,null,"NO",null,null,5,null,null,null,null,null,null,null,null,"x","x",0,5,5]
[null,"Vibration of Rigging","YES",null,"NO",null,null,"NO",null,null,3,null,null,null,null,null,null,null,"x","x","x",3,3,3]
[null,"Effect of Lightning Strikes","unknown",null,"unknown",null,null,"unknown",null,null,0,null,null,null,null,null,null,null,"x","x","x",0,0,0]
[null,"Pretension***","Lower (about 50%)",null,"Higher",null,null,"Higher",null,null,3,null,null,null,null,null,null,null,"x",null,null,3,{"$f":"IF(T135=\"X\",$K135,0)","v":0},{"$f":"IF(U135=\"X\",$K135,0)","v":0}]
[null,"Terminal Costs (may be offset by labor)","Lower",null,"Higher",null,null,"Lowest",null,null,5,null,null,null,null,null,null,null,"x",null,"x",5,0,5]
[null,"UNWEIGHTED SCORE",{"$f":"COUNTIF(S119:S136,\"x\")/nbr","v":0.61111111111111116},null,{"$f":"COUNTIF(T119:T136,\"x\")/nbr","v":0.83333333333333337},"6/13",null,{"$f":"COUNTIF(U119:U136,\"x\")/nbr","v":0.61111111111111116},"6/13",null,{"$f":"SUM(K119:K136)","v":86},null,null,null,null,null,null,null,{"$f":"COUNTIF(S119:S136,\"x\")/nbr","v":0.61111111111111116},{"$f":"COUNTIF(T119:T136,\"x\")/nbr","v":0.83333333333333337},{"$f":"COUNTIF(U119:U136,\"x\")/nbr","v":0.61111111111111116},{"$f":"SUM(V119:V136)/weigh_sum","v":0.58139534883720934},{"$f":"SUM(W119:W136)/weigh_sum","v":0.84883720930232553},{"$f":"SUM(X119:X136)/weigh_sum","v":0.58139534883720934}]
[null,"WEIGHTED SCORE",{"$f":"V137","v":0.58139534883720934},null,{"$f":"W137","v":0.84883720930232553},"6/13",null,{"$f":"X137","v":0.58139534883720934},"6/13",null,{"$f":"nbr","v":18}]
[null,"* Swaged upper terminals with Hi-Mod Lower Terminals is a reasonable option if trusted swaging is available",null,null,null,null,null,null,null,null,null,null,null,null,null,null,null,null,{"$f":"(COUNTA(S119:S136)+COUNTBLANK(S119:S136))","v":18},"<- TOTAL ITEMS"]
[null,"** With a lighter weight aloft the boat becomes stiffer.  A stiffer boat puts more stress on the rig in high winds and high seas.  This is theoretical and may not apply to the heavy KP44"]
[null,"*** The pretension seems to mask the linear expansion/contraction of the rigging and it still stays in the performance window for stretch.   It may also reduce the dynamic loading effect.\n"]
[]
[null,"Questions:",null,"Answers:"]
[null,"1. New Clevis Pins?",null,"NEW ONES, BUT NOT GENERALLY CONSIDERED A WEAK LINK!"]
[null,"2. New Tangs",null,"BOLTS INSPECT AND REPLACE.  ",null,null,"DON'T CHANGE ANYTHING."]
[null,"3. HM Rope Staysail Stay?",null,"COULD BE GOOD BUT OK TO RETAIN EXISTING STAY"]
[null,"4.  Recommendations for brand of Toggles",null,"CHEAPER TOGGLES ARE FINE"]
[null,"5.  New  Bronze Turnbuck Barrels add $200",null,"PERHAPS AT JIBSTAY"]
[]
[null,"Notes:"]
[null,"1. Jibstay pin-to-pin max length = 53'-11.125\" or 53.927' or 16.44m"]
[]
[null,"Korean vs. Type 316 Wire"]
[null,"KOS Wire"]

{"sheet":"Cost Comparisons","index":1,"n_rows":17,"n_cols":9,"rows_kept":17,"cut":false,"hidden":false,"merged":[]}
[]
[]
[]
[]
[null,null,null,{"$f":"'Saved Configurations'!B3","v":"ID NBR"},"CONFIGURATION",{"$f":"'Saved Configurations'!E3","v":"TYPE"},{"$f":"'Saved Configurations'!I3","v":"Wire Cost"},{"$f":"'Saved Configurations'!H3","v":"Elem. Cost"},{"$f":"'Saved Configurations'!J3","v":"Tot Cost"}]
[null,null,null,{"$f":"'Saved Configurations'!B4","v":1},{"$f":"'Saved Configurations'!C4","v":"All Hi-Mod with 7/16\" V1"},{"$f":"'Saved Configurations'!E4","v":"Discontinuous Rigging"},{"$f":"'Saved Configurations'!I4","v":1112.01},{"$f":"'Saved Configurations'!H4","v":2886.33},{"$f":"'Saved Configurations'!J4","v":3998.34}]
[null,null,null,{"$f":"'Saved Configurations'!B5","v":2},{"$f":"'Saved Configurations'!C5","v":"Mixed Hi-Mod and Swaged with 7/16\" V1"},{"$f":"'Saved Configurations'!E5","v":"Discontinuous Rigging"},{"$f":"'Saved Configurations'!I5","v":1112.01},{"$f":"'Saved Configurations'!H5","v":2235.88},{"$f":"'Saved Configurations'!J5","v":3347.8900000000003}]
[null,null,null,{"$f":"'Saved Configurations'!B6","v":3},{"$f":"'Saved Configurations'!C6","v":"All Hi-Mod with 10mm 1x19 V1"},{"$f":"'Saved Configurations'!E6","v":"Discontinuous Rigging"},{"$f":"'Saved Configurations'!I6","v":1306.94},{"$f":"'Saved Configurations'!H6","v":1910.49},{"$f":"'Saved Configurations'!J6","v":3217.4300000000003}]
[null,null,null,{"$f":"'Saved Configurations'!B7","v":4},{"$f":"'Saved Configurations'!C7","v":"All Swaged with 10mm 1x19 V1"},{"$f":"'Saved Configurations'!E7","v":"Discontinuous Rigging"},{"$f":"'Saved Configurations'!I7","v":1306.94},{"$f":"'Saved Configurations'!H7","v":1126.8399999999999},{"$f":"'Saved Configurations'!J7","v":2433.7799999999997}]
[null,null,null,{"$f":"'Saved Configurations'!B8","v":5},{"$f":"'Saved Configurations'!C8","v":"Mixed Hi-Mod and Swaged with 10mm 1x19 V1"},{"$f":"'Saved Configurations'!E8","v":"Discontinuous Rigging"},{"$f":"'Saved Configurations'!I8","v":1306.94},{"$f":"'Saved Configurations'!H8","v":2139.14},{"$f":"'Saved Configurations'!J8","v":3446.08}]
[null,null,null,{"$f":"'Saved Configurations'!B9","v":6},{"$f":"'Saved Configurations'!C9","v":"All swaged with 7/16\" V1"},{"$f":"'Saved Configurations'!E9","v":"Discontinuous Rigging"},{"$f":"'Saved Configurations'!I9","v":1112.01},{"$f":"'Saved Configurations'!H9","v":1566.73},{"$f":"'Saved Configurations'!J9","v":2678.74}]
[null,null,null,{"$f":"'Saved Configurations'!B10","v":7},{"$f":"'Saved Configurations'!C10","v":"All Hi-Mod"},{"$f":"'Saved Configurations'!E10","v":"Continuous Rigging"},{"$f":"'Saved Configurations'!I10","v":1112.01},{"$f":"'Saved Configurations'!H10","v":1560.94},{"$f":"'Saved Configurations'!J10","v":2672.95}]
[null,null,null,{"$f":"'Saved Configurations'!B11","v":8},{"$f":"'Saved Configurations'!C11","v":"All Hi-Mod 10mm-Compact Strand V1 Swaged forestay"},{"$f":"'Saved Configurations'!E11","v":"Discontinuous Rigging"},{"$f":"'Saved Configurations'!I11","v":1119.45},{"$f":"'Saved Configurations'!H11","v":2060.25},{"$f":"'Saved Configurations'!J11","v":3179.7}]
[null,null,null,{"$f":"'Saved Configurations'!B12","v":9},{"$f":"'Saved Configurations'!C12","v":"V1 Price Analysis 10mm Dyrform"},{"$f":"'Saved Configurations'!E12","v":"Discontinuous Rigging"},{"$f":"'Saved Configurations'!I12","v":245.03},{"$f":"'Saved Configurations'!H12","v":369.47},{"$f":"'Saved Configurations'!J12","v":614.5}]
[null,null,null,{"$f":"'Saved Configurations'!B13","v":10},{"$f":"'Saved Configurations'!C13","v":"V1 Price Analysis 7/16 1x19 "},{"$f":"'Saved Configurations'!E13","v":"Discontinuous Rigging"},{"$f":"'Saved Configurations'!I13","v":105.6},{"$f":"'Saved Configurations'!H13","v":837.28},{"$f":"'Saved Configurations'!J13","v":942.88}]
[null,null,null,{"$f":"'Saved Configurations'!B14","v":11},{"$f":"'Saved Configurations'!C14","v":"All Hi-Mod 10mm Compact Strand V1 w/o Forestay"},{"$f":"'Saved Configurations'!E14","v":"Discontinuous Rigging"},{"$f":"'Saved Configurations'!I14","v":837.65},{"$f":"'Saved Configurations'!H14","v":1577.28},{"$f":"'Saved Configurations'!J14","v":2414.9299999999998}]
[null,null,null,{"$f":"'Saved Configurations'!B15","v":12},{"$f":"'Saved Configurations'!C15","v":"All Hi-Mod 10mm-Compact Strand V1"},{"$f":"'Saved Configurations'!E15","v":"Discontinuous Rigging"},{"$f":"'Saved Configurations'!I15","v":1119.45},{"$f":"'Saved Configurations'!H15","v":2133.65},{"$f":"'Saved Configurations'!J15","v":3253.1000000000004}]

{"sheet":"Products Ordered","index":2,"n_rows":21,"n_cols":9,"rows_kept":21,"cut":false,"hidden":false,"merged":[]}
[]
[]
[]
[]
[]
[null,null,"DATE","SUPPLIER ","WIRE","SIZE","LEN","PRICE","TOT+GST"]
[null,null,"2012-09-18","RopeCable (Greg Arcus)","316 1x19","8mm",22,5.5,{"$f":"G7*H7*1.1","v":133.10000000000002}]
[null,null,"2012-09-18","RopeCable (Greg Arcus)","316 1x19","10mm",82,7,{"$f":"G8*H8*1.1","v":631.40000000000009}]
[null,null,null,null,null,null,null,null,{"$f":"SUM(I7:I8)","v":764.50000000000011}]
[]
[]
[null,null,"DATE","SUPPLIER ","WIRE","SIZE","LEN","PRICE","TOT+GST"]
[null,null,"2012-09-18","RopeCable (Greg Arcus)","316 1x19","8mm",{"$f":"52-G7","v":30},5.5,{"$f":"G13*H13*1.1","v":181.50000000000003}]
[null,null,"2012-09-18","RopeCable (Greg Arcus)","316 1x19","10mm",{"$f":"29-G8","v":-53},7,{"$f":"G14*H14*1.1","v":-408.1}]
[null,null,null,null,null,null,null,null,{"$f":"SUM(I13:I14)","v":-226.6}]
[]
[null,null,"DATE","SUPPLIER ","WIRE","SIZE","LEN","PRICE","TOT+GST"]
[null,null,"2012-09-18","RopeCable (Greg Arcus)","316 1x19","10mm D",12,{"$f":"24.75*0.75","v":18.5625},{"$f":"G18*H18*1.1","v":245.02500000000001}]
[null,null,"2012-09-18","RopeCable (Greg Arcus)","316 1x19","8mm",9,{"$f":"7.24*0.75","v":5.43},{"$f":"G19*H19*1.1","v":53.757000000000005}]
[null,null,null,null,null,null,null,"FREIGHT",26]
[null,null,null,null,null,null,null,null,{"$f":"SUM(I18:I20)","v":324.78200000000004}]

{"sheet":"Notes","index":3,"n_rows":31,"n_cols":2,"rows_kept":31,"cut":false,"hidden":false,"merged":[]}
[]
[]
[]
[]
[null,"Good Old Boat, Quick Attach, Sta-Lok, Norseman, swasless fittings"]
[]
[null,"A couple of excerpts. "]
[]
[null,"(Test 1), you will see that the swage fitting held onto the wire to a peak load of 4,112 pounds before slipping. The wire did not break; it pulled out of the fitting. This was a successful test as the wire breaking strength was rated at 4,000 pounds, and the fitting exceeded that load. The other two fittings were tested to verify the baseline. One test was satisfactory, and one tested well below the braking strength of the wire (This terminal brand was retested at a later time with an assembly made up by the supplier. It also failed the second test.) "]
[]
[null,"The swaged terminal, as well as the Sta-Lok and the Suncor swageless terminals, passed the initial round of tests by breaking at a load slightly in excess of the wire’s rated ultimate breaking strength.. The Norseman terminal failed at 69 percent of the wire’s rated ultimate breaking strength. When the supplier was contacted concerning this, they offered to supply another terminal and wire assembly made up by their own staff. This terminal and wire assembly also failed the test, breaking at 80 percent of the rated breaking strength of the wire."]
[]
[null,"John Franta, Colligo\n\nWe have done, and continue to do UV testing on Dynex Dux (Heat Stretched/ Work Hardened Dyneema). Since we use and promote this for standing rigging this is very important to us. Dyneema fibers are the best synthetic fibers for UV resistance. We have enough data to recommend a 5-8 year replacement interval in the tropics. The data is still coming in and I believe that we will end up recommending an 8 year replacement interval for standing rigging. All this is for uncovered Dynex Dux that is/was initially treated with a Urethane Coating to help with friction and UV resistance. \nKeep in mind that most steel manufacturers recommend an 8 year replacement interval for salt water boats.\n \nThe mechanism for UV damage on dyneema is such that the line experiences some external UV damage and then becomes somewhat opague for UV Rays so the damage rate diminishes considerably.\n \nAlso, this is based on the fact that we size the line for Stretch and Creep (not breaking strength). This type of sizing always ends up with line that is 2-5 times stronger than 1x19 spec'd for the same application. So you have a considerable factor of safety for strength.\n \nJohn Franta, Colligo Marine"]
[]
[null,"Another point I am curious about... You made up a couple of DUX runners for me that came out GREAT. Thanks for the accuracy! They are for my running backstays, and DUX seems like a perfect application here. I normally leave them \"made up\" and fairly snug, to use as a handhold when boarding the boat. When using the staysail, I will put 4 more turns on the \"quick adjust\" handle turnbuckles, but so far, haven't given them the acid test.\n\nI go to the boat daily, and have noticed that @ 75 degrees F, the runners are quite snug, but @ 40 degrees F, perhaps that same morning, they hang completely limp. Since solid materials expand when heated, and contract when cooled, it can't be that the DUX has gotten longer on a cool morning. I assume that the metal mast has contracted at a rate vastly higher than the DUX, creating loose runners in the morning. Presumably with wooden or composite spars this is less of a problem,. My wire rigging has never done this \"changing tune with temperature\", and I imagine that it's because the wire expands and contracts at a rate somewhat similar to the metal mast. \n"]
[null,"We are just about to embark on the complete replacement of the athwartships rigging on a 110 foot 200 ton three masted schooner.\n \nI am completely confident that our standard system of calibrated Dynex Dux with a Dyneema overbraid into our custom thimbles in standard turnbuckles is more that capable of handling any chafe, shock loading or U V degradation that the Australian environment can dish out.\n \nThe bare Dyneema line standing rigging is fine for do-it-yourselfers and has a role to play as an emergency shroud and, it must be said, has given outstanding service on many boats, but for true longevity you should consider the Dux with overbraid.\n \nI too have witnessed the rubbing-off effect of the Dyneema U/V \"Bloom\" on an early (1991) pair of bare Dyneema runners that I replaced FOC as a matter of courtesy.\n \nThe memory of this event was the catalyst for my development, WAY back in 2006 !, of termination and proving systems to allow our use of Dynex Dux with Overbraid for standing rigging.\n \n\nRegards,\n \nJoe Henderson, Henderson Rigging."]
[]
[null,"http://www.rigging.com.au/dynex_dux_overbraid.htm"]
[]
[null,"Hi Mark, please see the FAQ's on our site about Colligo Dux Rigging.\n We now have enough data to say 5-8 years for a replacement interval of Dynex Dux in the Tropics. This data is still coming in and we are watching it closely. As an engineer and a sailor, I can tell you that I wouldn't feel comfortable going offshore with a stainless rig on a saltwater boat over 10 years old unless, possibly, I knew it was washed with freshwater almost daily. Maybe with stayloks that were completely inspected, certainly not swage fittings. To my knowledge, most of the wire rope manufacturers recommend 8-10 years as a replacement interval for stainless wire. I am sure Brion has a valuable opinion here.\n \nOn the tuning, 2 things.\n \n1. The coeficient of thermal expansion (COTE) of dyneema is less than that of aluminum, so you get a difference in expansion rates in the temperature ranges you see on a boat. If you do some calcs on an aluminum mast you would probably be surprised on how much growth you can expect. The COTE of Steel is also different than aluminum but not as much and is usually masked by the higher amount of pretension with turnbuckles.\n \nIf you use turnbuckles with some amount of pretension you will usually not see the loosening of the shrouds, if you use lashings than you will probably notice it as the amount of pretension will probably not be enough to cover the thermal expansion of the mast. Some of our customers have noticed this and after tensioning in colder weather they have enough pretension to not see the issue again. If you have a rig that requires more pretension (or better control of tension) we recommend using turnbuckles for pre-tensioning. \n\nWe also now have Loos gauge calibrations for several sizes of Dux to help with setting the tension. \n\nYou will have a little more maintenance with Colligo Dux, especially with lashing tensioners, but you should expect this as you need to inspect for chafe more (than steel) also. All synthetics, PBO, Carbon, Dyneema, Aramids, etc put more responsiblity in the hands of the sailor as there are alot of unknowns as none of them have been used as long as Steel.\n \nYou will not find a synthetic rig that will give you the same amount of confidence as steel for probably about another 100 years or so. \n\nJohn Franta, Colligo Marine"]
[]
[null,"Hello all,\n We are in the process of returning to a world where sailors are a living part of their rigs, responsible for design and fabrication, as well as maintenance and use. Part of that process requires familiarizing ourselves with the assorted materials, and the interactions thereof. The expansion issue being discussed here is a piece of that.\n As John notes, the pretension required for a (proper) tune with wire masks differences in expansion rates for aluminum and steel. But if you put a tension gauge on the wire on a cold day, and then a warm one, I think you'll be surprised at the difference. In the Northwest, we can use this to our advantage, as the colder days usually have higher windspeeds.\n With Spectra, very little pretension is normally needed, so there's less \"travel\" needed for the rigging to go slack. This might mean more frequent or seasonal adjustment, and it might mean finding an average pretension -- under the \"creep\" level -- to tune to.\n As for longevity, it looks like uncovered Spectra will last at least as long, safely, as stainless in the same climate. Covered Spectra, which costs about 40% more and is more difficult to splice, might still end up being long-term cheaper, as it will basically be immortal. That's why I'm recommending it to cruisers who expect to be in the Tropics for any length of time. Might make a difference in resale value, too. And even with the extra cover weight, it's still lighter than wire.\n Fair leads,\n Brion Toss"]
[]
[null,"Swaged rigging varies in quality depending upon the operator and type of machine.  Mechanical fittings are undoubtedly the best, but are more expensive and take more time (usually) than swaged fittings.  See quote below:"]
[]
[null,"Swaged fittings are cheaper (Less costly) in materials and labor for a shop equipped with swaging equipment. If they do enough rigging to justify the initial investment in tooling, it makes sense. The shop can do more rigging, offer a more economical alternative to the consumer and turn a higher profit margin as well.\n\nWhen I re-rigged Lealea last year, the rigger at Ala Wai Marine initially questioned my choice of Sta-Lok fittings and tried to convince me to use swaged fittings instead. He based his argument on cost, pointing out that I would save a fair amount of money if I used swaged fittings. I told him I had made my decision and would go with the Sta-Loks. A little while later he came over to the boat and watched us at work for while. When I walked up to him he asked a few questions about what my long term plans were and what I intended doing with the boat. He looked the boat over and said \"OK, now I understand. Come over to the shop later and I'll show you how to set up that rig properly.\" When I went to his shop that afternoon, he explained how most boat owners didn't want to go to the effort of installing mechanical end fittings themselves and didn't want to spend the money to have the yard do the work either. That, combined with the cost of the fittings themselves, caused most boat owners facing new standing rigging to opt for the less expensive swaged fittings.\n\nSwaged fittings work fine for 99 out of 100 applications and the have the advantages of being less costly for the boat owner and more profitable for the yard. However if you want the strongest, longest lived setup available with the added advantage of reuseability and installation with common hand tools, and if cost is a secondary concern, mechanical fittings such as Sta-Lok or Norseman would be my choice "]
[]
[null,"In making this decision you are balancing a number of different variables:  price, installation hours, convenience, strength, and lifetime of the rig.  If you DIY it the consideration is different than if you turn the problem over to a professional rigger who is interested in making a profit as well.  The reason many boats are NOT rigged with the clearly superior mechanical (swageless) fittings are the cost of the fittings and the labor involved.   In looking through posts on the Internet several people refer to swage failures but nobody has every referred to a mechanical fitting failure.  There are few references to Hi-Mod fittings (IMO clearly superior) and many to Navtec / Stalok fittings.  Navtecs in the older posts, mostly.  There is test evidence that Sta-Lok fittings are much superior to Navtec and I think Hi-Mods are superior to both - mostly because they don't require new crown rings each time you open them up and they are essentially fail-safe in design."]
[]
[null,"Q 6. Do you have any knowledge from trials or reality what happens if the mast is hit by lightning? \nUsually the lightening will follow the mast as it is the path of least resistance. Lightening is high voltage but relatively low amperage. This line does not conduct so the only problem is if the temp would get high enough to melt it. The heat would have to conduct thru the mast brackets, then thru the line terminator to the line. I recently read an article in Pro Boat builders mag about lightening on a carbon mast. They inspected it using several techniques but the damage was only to about 18 inches from the mast. So the temp did not get high enough beyond that to delaminate the material. Having said all this I think we just don't really have enough concrete info to make a clear statement here. There are too many variables. But, I think it is the same with steel rigging, only there is more history, but what can we predict about lightening? \n"]
[null,"http://www.cruisersforum.com/forums/f116/dynex-dux-synthetic-rigging-59687.htmlHaving used it on my runners, I am pleased, \"for this application\". I have noticed a PRONOUNCED difference in the way the runners change tune, VS the old wire, over a 40 degree temperature range. For a shorter, fatter, extrusion that is easy to keep in column, this may not be an issue. Indeed, many are pleased with their results. For long, skinny extrusions like mine, where lowest stretch and temperature stability are paramount, I will be switching to \"compact strand wire\", and stick with my StaLocs. M.\n\nJohn Franta's last comments:\n\nOriginally Posted by echidna \nHi Brion,\n\nWell, I would say that my 0-30 Centigrade temperature range is quite reasonable, even conservative, for a boat left in the water year round (or hauled for winter rig-in) in New Jersey (where I used to sail), having on the one hand wilted in summer heat in the high 90's (Fahrenheit), and used my former boat as an ice breaker in the destination harbor (and near frozen to death) on a December trip to Mamaroneck, NY.\n\nRegarding loads and creep, I just went to the Colligo site to refresh my memory on their creep data, and could not find the relevant information. It seems to have been removed - Google cache still has it though.\n\nAssuming the old data was correct, a load 12% of breaking strength would cause creep of over 3\" per year in 50ft at 22 deg C. I'm not sure that is acceptable.\n\nThe question now is, was that old Colligo data valid, and what happened to it? Insofar as creep is probably the dominant consideration in sizing Dyneema for stays, it's important to have good information on it.\n\nI'd also like to raise another point related to temperature effects, and that is the temperature dependence of creep. Creep is typically strongly dependent on temperature, and the equation on the old Colligo graph would imply that the creep rate for a given load in Dyneema doubles with every 4 deg C temperature increase. So in discussing creep, it is surely essential to indicate the expected ambient temperature. Temperatures in the tropics could easily be 5-10 deg C higher than the 22 deg C reference point used in the old Colligo data. Probably a topic for another thread, really.\n\n\nJohn: Due to many issues with understanding the creep data (or misunderstanding it), we are keeping it interrnal now. We can assist with sizing Colligo Dux Rigging with anyone who asks. For the time this is how we size the line in order of priority:\n\n1. Stretch\n2. Creep\n3. Breaking strength.\n\nWe almost always have the line at much less than 10% of strength effiiciency, mostly based on stretch. Creep is figured at pretension and 0.1\" per year is a maximum target. (@22C). This seems to be a good conservative number as we have many boats now rigged with normal travel turnbuckles that have not gotten into creep issues. One 65' monohull in the Carribean. For offshore boats we factor in long term dynamic loads as well. Keep in mind that creep happens over time, so average temperatures are what you need to look at, or time at temp if you have access to that kind of data.\n"]

{"sheet":"Hayn Catalog","index":4,"n_rows":2474,"n_cols":9,"rows_kept":2474,"cut":false,"hidden":false,"merged":[[1,0,1,4],[2,0,2,1],[2,2,2,4]]}
[]
["HAYN RIGGING PRODUCTS"]
["2012 Pricing List - Effective January 01, 2012",null,"Revision 12.01"]
["Item","Description","List Price","Cat. Page","FISCO PRICE"]
["Rigging Hardware Section",null,null,null,0.7]
[]
["Rigging Turnbuckles - Jaw to Jaw ( T Bolt ) (Open Forged Bronze TFBJ Series)"]
["14TFBJ","Jaw to Jaw TFB 1/4\" Jaw 1/4\" Pin        ",39.520000000000003,5,{"$f":"IF(ISBLANK(C8),\"\",C8*$E$5)","v":27.664000000000001}]
["14TFBJB","Jaw to Jaw TFB 1/4\" Jaw 1/4\" Pin-UC     ",37.869999999999997,5,{"$f":"IF(ISBLANK(C9),\"\",C9*$E$5)","v":26.508999999999997}]
["516TFBJ","Jaw to Jaw TFB 5/16\" Jaw 5/16\" Pin       ",61.93,5,43.350999999999999]
["516TFBJB","Jaw to Jaw TFB 5/16\" Jaw 5/16\" Pin-UC    ",61.93,5,43.350999999999999]
["38TFBJ","Jaw to Jaw TFB 3/8\" Jaw 3/8\" Pin          ",77.790000000000006,5,54.453000000000003]
["38TFBJB","Jaw to Jaw TFB 3/8\" Jaw 3/8\" Pin-UC       ",77.790000000000006,5,54.453000000000003]
["12TFBJ","Jaw to Jaw TFB 1/2\" Jaw 1/2\" Pin         ",120.43,5,84.301000000000002]
["12TFBJB","Jaw to Jaw TFB 1/2\" Jaw 1/2\" Pin-UC      ",120.43,5,84.301000000000002]
["58TFBJ","Jaw to Jaw TFB 5/8\" Jaw 5/8\"Pin          ",201.08,5,140.756]
["58TFBJB","Jaw to Jaw TFB 5/8\" Jaw 5/8\" Pin-UC       ",201.08,5,140.756]
["34TFBJ","Jaw to Jaw TFB 3/4\" Jaw 3/4\" Pin          ",344.08,5,240.85599999999997]
["34TFBJB","Jaw to Jaw TFB 3/4\" Jaw 3/4\" Pin-UC       ",344.08,5,240.85599999999997]
[null,null,null,null,""]
["Rigging Turnbuckles - Eye Toggle to Eye Toggle (Forged Bronze ETFBJ Series)",null,null,null,""]
["14ETFBJ","Eye Toggle to Eye Toggle ETFBJ 1/4\" Pin 1/4\" Jaw",50.97,5,35.678999999999995]
["14ETFBJB","Eye Toggle to Eye Toggle ETFBJ 1/4\" Pin 1/4\" Jaw-UC",50.97,5,35.678999999999995]
["516ETFBJ","Eye Toggle to Eye Toggle ETFBJ 5/16\" Pin 5/16\" Jaw",64.790000000000006,5,45.353000000000002]
["516ETFBJB","Eye Toggle to Eye Toggle ETFBJ 5/16\" Pin 5/16\" Jaw-UC",64.790000000000006,5,45.353000000000002]
["38ETFBJ","Eye Toggle to Eye Toggle ETFBJ 3/8\" Pin 3/8\" Jaw",77.790000000000006,5,54.453000000000003]
["38ETFBJB","Eye Toggle to Eye Toggle ETFBJ 3/8\" Pin 3/8\" Jaw-UC",77.790000000000006,5,54.453000000000003]
["12ETFBJ","Eye Toggle to Eye Toggle ETFBJ 1/2\" Pin 1/2\" Jaw",120.43,5,84.301000000000002]
["12ETFBJB","Eye Toggle to Eye Toggle ETFBJ 1/2\" Pin 1/2\" Jaw-UC",120.43,5,84.301000000000002]
["58ETFBJ","Eye Toggle to Eye Toggle ETFBJ 5/8\" Pin 5/8\" Jaw",201.08,5,140.756]
["58ETFBJB","Eye Toggle to Eye Toggle ETFBJ 5/8\" Pin 5/8\" Jaw-UC",201.08,5,140.756]
["34ETFBJ","Eye Toggle to Eye Toggle ETFBJ 3/4\" Pin 3/4\" Jaw",355.54,5,248.87799999999999]
["34ETFBJB","Eye Toggle to Eye Toggle ETFBJ 3/4\" Pin 3/4\" Jaw-UC",355.54,5,248.87799999999999]
["78ETFBJ","Eye Toggle to Eye Toggle ETFBJ 7/8\" Pin 7/8\" Jaw",974.9,5,682.43]
["1ETFBJ","Eye Toggle to Eye Toggle ETFBJ 1\" Pin 1\" Jaw",2007.14,5,1404.998]
[null,null,null,null,""]
["Rigging Turnbuckles - Jaw to Swage ( T Bolt ) (Forged Bronze TFBS Series) - Imperial Wire Sizes",null,null,null,""]
["14TFBS332","Jaw to Swage TFB 3/32\" Wire 1/4\" Pin     ",38.6,6,27.02]
["14TFBS332B","Jaw to Swage TFB 3/32\" Wire 1/4\" Pin-UC  ",36.97,6,25.878999999999998]
["14TFBS18","Jaw to Swage TFB 1/8\" Wire 1/4\" Pin      ",38.64,6,27.047999999999998]
["14TFBS18B","Jaw to Swage TFB 1/8\" Wire 1/4\" Pin-UC   ",36.99,6,25.893000000000001]
["14TFBS532","Jaw to Swage TFB 5/32\" Wire 1/4\" Pin     ",37.85,6,26.495000000000001]
["14TFBS532B","Jaw to Swage TFB 5/32\" Wire 1/4\" Pin-UC  ",37.85,6,26.495000000000001]
["516TFBS532","Jaw to Swage TFB 5/32\" Wire 5/16\" Pin    ",42.43,6,29.700999999999997]
["516TFBS532B","Jaw to Swage TFB 5/32\" Wire 5/16\" Pin-UC ",42.43,6,29.700999999999997]
["516TFBS316","Jaw to Swage TFB 3/16\" Wire 5/16\" Pin    ",45.59,6,31.913]
["516TFBS316B","Jaw to Swage TFB 3/16\" Wire 5/16\" Pin-UC ",45.59,6,31.913]
["38TFBS316","Jaw to Swage TFB 3/16\" Wire 3/8\" Pin     ",65.53,6,45.870999999999995]
["38TFBS316B","Jaw to Swage TFB 3/16\" Wire 3/8\" Pin-UC  ",65.53,6,45.870999999999995]
["38TFBS732","Jaw to Swage TFB 7/32\" Wire 3/8\" Pin     ",68.63,6,48.040999999999997]
["38TFBS732B","Jaw to Swage TFB 7/32\" Wire 3/8\" Pin-UC  ",68.63,6,48.040999999999997]
["38TFBS14","Jaw to Swage TFB 1/4\" Wire 3/8\" Pin      ",70.569999999999993,6,49.398999999999994]
["38TFBS14B","Jaw to Swage TFB 1/4\" Wire 3/8\" Pin-UC   ",70.569999999999993,6,49.398999999999994]
["12TFBS14","Jaw to Swage TFB 1/4\" Wire 1/2\" Pin      ",93.36,6,65.35199999999999]
["12TFBS14B","Jaw to Swage TFB 1/4\" Wire 1/2\" Pin-UC   ",93.36,6,65.35199999999999]
["12TFBS932","Jaw to Swage TFB 9/32\" Wire 1/2\" Pin     ",98.53,6,68.970999999999989]
["12TFBS932B","Jaw to Swage TFB 9/32\" Wire 1/2\" Pin-UC  ",98.53,6,68.970999999999989]
["12TFBS516","Jaw to Swage TFB 5/16\" Wire 1/2\" Pin     ",106.25,6,74.375]
["12TFBS516B","Jaw to Swage TFB 5/16\" Wire 1/2\" Pin-UC  ",106.25,6,74.375]
["58TFBS516","Jaw to Swage TFB 5/16\" Wire 5/8\" Pin     ",147.02000000000001,6,102.914]
["58TFBS516B","Jaw to Swage TFB 5/16\" Wire 5/8\" Pin-UC  ",147.02000000000001,6,102.914]
["58TFBS38","Jaw to Swage TFB 3/8\" Wire 5/8\" Pin      ",157.65,6,110.355]
["58TFBS38B","Jaw to Swage TFB 3/8\" Wire 5/8\" Pin-UC   ",157.65,6,110.355]
["34TFBS716","Jaw to Swage TFB 7/16\" Wire 3/4\" Pin     ",273.35000000000002,6,191.345]
["34TFBS716B","Jaw to Swage TFB 7/16\" Wire 3/4\" Pin-UC  ",273.35000000000002,6,191.345]
["34TFBS12","Jaw to Swage TFB 1/2\" Wire 3/4\" Pin      ",321.14,6,224.79799999999997]
["34TFBS12B","Jaw to Swage TFB 1/2\" Wire 3/4\" Pin-UC   ",321.14,6,224.79799999999997]
[null,null,null,null,""]
["Rigging Turnbuckles - Jaw to Swage ( T Bolt ) (Forged Bronze TFBS Series) - Metric Wire Sizes",null,null,null,""]
["14TFBSM03","Jaw to Swage TFB 3mm Wire 1/4\" Pin      ",38.64,6,27.047999999999998]
["14TFBSM03B","Jaw to Swage TFB 3mm Wire 1/4\" Pin -UC     ",36.99,6,25.893000000000001]
["14TFBSM04","Jaw to Swage TFB 4mm Wire 1/4\" Pin   ",37.85,6,26.495000000000001]
["14TFBSM04B","Jaw to Swage TFB 4mm Wire 1/4\" Pin-UC   ",37.85,6,{"$f":"IF(ISBLANK(C73),\"\",C73*$E$5)","v":26.495000000000001}]
["516TFBSM04","Jaw to Swage TFB 4mm Wire 5/16\" Pin    ",42.43,6,29.700999999999997]
["516TFBSM04B","Jaw to Swage TFB 4mm Wire 5/16\" Pin-UC    ",42.43,6,29.700999999999997]
["516TFBSM05","Jaw to Swage TFB 5mm Wire 5/16\" Pin     ",45.59,6,31.913]
["516TFBSM05B","Jaw to Swage TFB 5mm Wire 5/16\" Pin-UC    ",45.59,6,31.913]
["38TFBSM05","Jaw to Swage TFB 5mm Wire 3/8\" Pin      ",65.73,6,46.011000000000003]
["38TFBSM05B","Jaw to Swage TFB 5mm Wire 3/8\" Pin-UC      ",65.53,6,45.870999999999995]
["38TFBSM06","Jaw to Swage TFB 6mm Wire 3/8\" Pin      ",70.569999999999993,6,49.398999999999994]
["38TFBSM06B","Jaw to Swage TFB 6mm Wire 3/8\" Pin-UC      ",70.569999999999993,6,49.398999999999994]
["12TFBSM06","Jaw to Swage TFB 6mm Wire 1/2\" Pin      ",93.36,6,65.35199999999999]
["12TFBSM06B","Jaw to Swage TFB 6mm Wire 1/2\" Pin-UC      ",93.36,6,65.35199999999999]
["12TFBSM07","Jaw to Swage TFB 7mm Wire 1/2\" Pin      ",93.36,6,65.35199999999999]
["12TFBSM07B","Jaw to Swage TFB 7mm Wire 1/2\" Pin-UC      ",93.36,6,65.35199999999999]
["12TFBSM08","Jaw to Swage TFB 8mm Wire 1/2\" Pin      ",93.36,6,65.35199999999999]
["12TFBSM08B","Jaw to Swage TFB 8mm Wire 1/2\" Pin-UC      ",93.36,6,65.35199999999999]
["58TFBSM08","Jaw to Swage TFB 8mm Wire 5/8\" Pin     ",157.65,6,110.355]
["58TFBSM08B","Jaw to Swage TFB 8mm Wire 5/8\" Pin-UC     ",157.65,6,110.355]
["58TFBSM10","Jaw to Swage TFB 10mm Wire 5/8\" Pin     ",157.65,6,110.355]
["58TFBSM10B","Jaw to Swage TFB 10mm Wire 5/8\" Pin-UC     ",157.65,6,110.355]
["34TFBSM11","Jaw to Swage TFB 11mm Wire 3/4\" Pin     ",284.16000000000003,6,198.91200000000001]
["34TFBSM11B","Jaw to Swage TFB 11mm Wire 3/4\" Pin-UC     ",284.16000000000003,6,198.91200000000001]
["34TFBSM12","Jaw to Swage TFB 12mm Wire 3/4\" Pin     ",284.16000000000003,6,198.91200000000001]
["34TFBSM12B","Jaw to Swage TFB 12mm Wire 3/4\" Pin-UC     ",284.16000000000003,6,198.91200000000001]
[null,null,null,null,""]
["Rigging Turnbuckles - Eye Toggle to Swage (Forged Bronze ETFB Series) - Imperial Wire Sizes",null,null,null,""]
["14ETFB332","Eye Toggle to Swage ETFB 3/32\" Wire 1/4\" Jaw",39.86,7,27.901999999999997]
["14ETFB332B","Eye Toggle to Swage ETFB 3/32\" Wire 1/4\" Jaw-UC",39.86,7,27.901999999999997]
["14ETFB18","Eye Toggle to Swage ETFB 1/8\" Wire 1/4\" Jaw ",39.86,7,27.901999999999997]
["14ETFB18B","Eye Toggle to Swage ETFB 1/8\" Wire 1/4\" Jaw-UC ",39.86,7,27.901999999999997]
["14ETFB532","Eye Toggle to Swage ETFB 5/32\" Wire 1/4\" Jaw",40.840000000000003,7,28.588000000000001]
["14ETFB532B","Eye Toggle to Swage ETFB 5/32\" Wire 1/4\" Jaw-UC",40.840000000000003,7,28.588000000000001]
["516ETFB532","Eye Toggle to Swage ETFB 5/16\" Wire 5/32\" Jaw",48.74,7,34.118000000000002]
["516ETFB532B","Eye Toggle to Swage ETFB 5/16\" Wire 5/32\" Jaw-UC",48.74,7,34.118000000000002]
["516ETFB316","Eye Toggle to Swage ETFB 3/16\" Wire 5/16\" Jaw",49.32,7,34.524000000000001]
["516ETFB316B","Eye Toggle to Swage ETFB 3/16\" Wire 5/16\" Jaw-UC",49.32,7,34.524000000000001]
["38ETFB316","Eye Toggle to Swage ETFB 3/16\" Wire 3/8\" Jaw ",68.819999999999993,7,48.173999999999992]
["38ETFB316B","Eye Toggle to Swage ETFB 3/16\" Wire 3/8\" Jaw-UC ",68.819999999999993,7,48.173999999999992]
["38ETFB732","Eye Toggle to Swage ETFB 7/32\" Wire 3/8\" Jaw ",72.260000000000005,7,50.582000000000001]
["38ETFB732B","Eye Toggle to Swage ETFB 7/32\" Wire 3/8\" Jaw-UC ",72.260000000000005,7,50.582000000000001]
["38ETFB14","Eye Toggle to Swage ETFB 1/4\" Wire 3/8\" Jaw ",70.569999999999993,7,49.398999999999994]
["38ETFB14B","Eye Toggle to Swage ETFB 1/4\" Wire 3/8\" Jaw-UC ",70.569999999999993,7,49.398999999999994]
["12ETFB14","Eye Toggle to Swage ETFB 1/4\" Wire 1/2\" Jaw  ",103.23,7,72.260999999999996]
["12ETFB14B","Eye Toggle to Swage ETFB 1/4\" Wire 1/2\" Jaw-UC  ",103.23,7,72.260999999999996]
["12ETFB932","Eye Toggle to Swage ETFB 9/32\" Wire 1/2\" Jaw ",120.43,7,84.301000000000002]
["12ETFB932B","Eye Toggle to Swage ETFB 9/32\" Wire 1/2\" Jaw-UC ",120.43,7,84.301000000000002]
["12ETFB516","Eye Toggle to Swage ETFB 5/16\" Wire 1/2\" Jaw ",126.16,7,88.311999999999998]
["12ETFB516B","Eye Toggle to Swage ETFB 5/16\" Wire 1/2\" Jaw-UC ",126.16,7,88.311999999999998]
["58ETFB516","Eye Toggle to Swage ETFB 5/16\" Wire 5/8\" Jaw ",166.31,7,116.41699999999999]
["58ETFB516B","Eye Toggle to Swage ETFB 5/16\" Wire 5/8\" Jaw-UC ",166.31,7,116.41699999999999]
["58ETFB38","Eye Toggle to Swage ETFB 3/8\" Wire 5/8\" Jaw  ",177.78,7,124.446]
["58ETFB38B","Eye Toggle to Swage ETFB 3/8\" Wire 5/8\" Jaw-UC  ",177.78,7,124.446]
["34ETFB716","Eye Toggle to Swage ETFB 7/16\" Wire 3/4\" Jaw ",286.74,7,200.71799999999999]
["34ETFB716B","Eye Toggle to Swage ETFB 7/16\" Wire 3/4\" Jaw-UC ",286.74,7,200.71799999999999]
["34ETFB12","Eye Toggle to Swage ETFB 1/2\" Wire 3/4\" Jaw ",344.08,7,240.85599999999997]
["34ETFB12B","Eye Toggle to Swage ETFB 1/2\" Wire 3/4\" Jaw-UC ",344.08,7,240.85599999999997]
["78ETFB916","Eye Toggle to Swage ETFB 9/16\" Wire 7/8\" Jaw ",934.75,7,654.32499999999993]
["1ETFB916","Eye Toggle to Swage ETFB 9/16\" Wire 1\" Jaw ",1491.02,7,1043.7139999999999]
["1ETFB58","Eye Toggle to Swage ETFB 5/8\" Wire 1\" Jaw ",1491.02,7,1043.7139999999999]
[null,null,null,null,""]
["Rigging Turnbuckles - Eye Toggle to Swage (Forged Bronze ETFB Series) - Metric Wire Sizes",null,null,null,""]
["14ETFBM03","Eye Toggle to Swage ETFB 3mm Wire 1/4\" Jaw  ",39.86,7,27.901999999999997]
["14ETFBM03B","Eye Toggle to Swage ETFB 3mm Wire 1/4\" Jaw-UC  ",39.86,7,27.901999999999997]
["14ETFBM04","Eye Toggle to Swage ETFB 4mm Wire 1/4\" Jaw ",39.86,7,27.901999999999997]
["14ETFBM04B","Eye Toggle to Swage ETFB 4mm Wire 1/4\" Jaw-UC ",39.86,7,27.901999999999997]
["516ETFBM04","Eye Toggle to Swage ETFB 4mm Wire 5/16\" Jaw ",48.74,7,{"$f":"IF(ISBLANK(C137),\"\",C137*$E$5)","v":34.118000000000002}]
["516ETFBM04B","Eye Toggle to Swage ETFB 4mm Wire 5/16\" Jaw-UC ",48.74,7,34.118000000000002]
["516ETFBM05","Eye Toggle to Swage ETFB 5mm Wire 5/16\" Jaw ",49.32,7,34.524000000000001]
["516ETFBM05B","Eye Toggle to Swage ETFB 5mm Wire 5/16\" Jaw-UC ",49.32,7,34.524000000000001]
["38ETFBM05","Eye Toggle to Swage ETFB 5mm Wire 3/8\" Jaw ",68.819999999999993,7,48.173999999999992]
["38ETFBM05B","Eye Toggle to Swage ETFB 5mm Wire 3/8\" Jaw-UC ",68.819999999999993,7,48.173999999999992]
["38ETFBM06","Eye Toggle to Swage ETFB 6mm Wire 3/8\" Jaw  ",70.569999999999993,7,49.398999999999994]
["38ETFBM06B","Eye Toggle to Swage ETFB 6mm Wire 3/8\" Jaw-UC  ",70.569999999999993,7,49.398999999999994]
["12ETFBM06","Eye Toggle to Swage ETFB 6mm Wire 1/2\" Jaw  ",103.23,7,72.260999999999996]
["12ETFBM06B","Eye Toggle to Swage ETFB 6mm Wire 1/2\" Jaw-UC  ",103.23,7,72.260999999999996]
["12ETFBM07","Eye Toggle to Swage ETFB 7mm Wire 1/2\" Jaw  ",120.43,7,84.301000000000002]
["12ETFBM07B","Eye Toggle to Swage ETFB 7mm Wire 1/2\" Jaw-UC  ",120.43,7,84.301000000000002]
["12ETFBM08","Eye Toggle to Swage ETFB 8mm Wire 1/2\" Jaw  ",126.16,7,88.311999999999998]
["12ETFBM08B","Eye Toggle to Swage ETFB 8mm Wire 1/2\" Jaw-UC  ",126.16,7,88.311999999999998]
["58ETFBM08","Eye Toggle to Swage ETFB 8mm Wire 5/8\" Jaw ",166.31,7,116.41699999999999]
["58ETFBM08B","Eye Toggle to Swage ETFB 8mm Wire 5/8\" Jaw-UC ",166.31,7,116.41699999999999]
["58ETFBM10","Eye Toggle to Swage ETFB 10mm Wire 5/8\" Jaw ",177.78,7,124.446]
["58ETFBM10B","Eye Toggle to Swage ETFB 10mm Wire 5/8\" Jaw-UC ",177.78,7,124.446]
["34ETFBM11","Eye Toggle to Swage ETFB 11mm Wire 3/4\" Jaw ",286.74,7,200.71799999999999]
["34ETFBM11B","Eye Toggle to Swage ETFB 11mm Wire 3/4\" Jaw-UC ",286.74,7,200.71799999999999]
["34ETFBM12","Eye Toggle to Swage ETFB 12mm Wire 3/4\" Jaw ",344.08,7,240.85599999999997]
["34ETFBM12B","Eye Toggle to Swage ETFB 12mm Wire 3/4\" Jaw-UC ",344.08,7,240.85599999999997]
["78ETFBM14","Eye Toggle to Swage ETFB 14mm Wire 7/8\" Jaw ",934.75,7,654.32499999999993]
["1ETFBM14","Eye Toggle to Swage ETFB 14mm Wire 1\" Jaw ",1491.02,7,1043.7139999999999]
["1ETFBM16","Eye Toggle to Swage ETFB 16mm Wire 1\" Jaw ",1491.02,7,1043.7139999999999]
[null,null,null,null,""]
["Rigging Turnbuckles - Eye to Swage (Forged Bronze TFBS Series) - Imperial Wire Sizes",null,null,null,""]
["14TFBS332E","Eye to Swage TFB 3/32\"Wire 1/4\" Eye",39.17,8,27.419]
["14TFBS332EB","Eye to Swage TFB 3/32\"Wire 1/4\" Eye-UC  ",37.53,8,26.271000000000001]
["14TFBS18E","Eye to Swage TFB 1/8\"Wire 1/4\" Eye    ",39.200000000000003,8,27.44]
["14TFBS18EB","Eye to Swage TFB 1/8\"Wire 1/4\" Eye-UC",37.549999999999997,8,26.284999999999997]
["14TFBS532E","Eye to Swage TFB 5/32\"Wire 1/4\" Eye ",42.19,8,29.532999999999998]
["14TFBS532EB","Eye to Swage TFB 5/32\"Wire 1/4\" Eye-UC  ",40.54,8,28.377999999999997]
["516TFBS532E","Eye to Swage TFB 5/32\"Wire 5/16\" Eye  ",50.58,8,35.405999999999999]
["516TFBS532EB","Eye to Swage TFB 5/32\"Wire 5/16\" Eye-UC ",48.94,8,34.257999999999996]
["516TFBS316E","Eye to Swage TFB 3/16\"Wire 5/16\" Eye ",52.08,8,36.455999999999996]
["516TFBS316EB","Eye to Swage TFB 3/16\"Wire 5/16\" Eye-UC",50.44,8,35.307999999999993]
["38TFBS316E","Eye to Swage TFB 3/16\"Wire 3/8\" Eye  ",60.8,8,42.559999999999995]
["38TFBS316EB","Eye to Swage TFB 3/16\"Wire 3/8\" Eye-UC ",59.17,8,41.418999999999997]
["38TFBS732E","Eye to Swage TFB 7/32\"Wire 3/8\" Eye  ",67.08,8,46.955999999999996]
["38TFBS732EB","Eye to Swage TFB 7/32\"Wire 3/8\" Eye-UC ",65.459999999999994,8,45.821999999999996]
["38TFBS14E","Eye to Swage TFB 1/4\"Wire 3/8\" Eye ",67.61,8,47.326999999999998]
["38TFBS14EB","Eye to Swage TFB 1/4\"Wire 3/8\" Eye-UC",65.989999999999995,8,46.192999999999991]
["12TFBS14E","Eye to Swage TFB 1/4\"Wire 1/2\" Eye      ",93.18,8,65.225999999999999]
["12TFBS14EB","Eye to Swage TFB 1/4\"Wire 1/2\" Eye-UC  ",89.93,8,62.951000000000001]
["12TFBS932E","Eye to Swage TFB 9/32\"Wire 1/2\" Eye",100.96,8,70.671999999999997]
["12TFBS932EB","Eye to Swage TFB 9/32\"Wire 1/2\" Eye-UC  ",97.71,8,68.396999999999991]
["12TFBS516E","Eye to Swage TFB 5/16\"Wire 1/2\" Eye  ",106.25,8,74.375]
["12TFBS516EB","Eye to Swage TFB 5/16\"Wire 1/2\" Eye-UC ",102.99,8,72.092999999999989]
["58TFBS516E","Eye to Swage TFB 5/16\"Wire 5/8\" Eye     ",152.68,8,106.876]
["58TFBS516EB","Eye to Swage TFB 5/16\"Wire 5/8\" Eye-UC ",149.44,8,104.60799999999999]
["58TFBS38E","Eye to Swage TFB 3/8\"Wire 5/8\" Eye ",161.69,8,113.18299999999999]
["58TFBS38EB","Eye to Swage TFB 3/8\"Wire 5/8\" Eye-UC ",158.44999999999999,8,110.91499999999999]
["34TFBS716E","Eye to Swage TFB 7/16\"Wire 3/4\" Eye ",275.26,8,192.68199999999999]
["34TFBS716EB","Eye to Swage TFB 7/16\"Wire 3/4\" Eye-UC ",270.38,8,189.26599999999999]
["34TFBS12E","Eye to Swage TFB 1/2\"Wire 3/4\" Eye  ",294.04000000000002,8,205.828]
["34TFBS12EB","Eye to Swage TFB 1/2\"Wire 3/4\" Eye-UC  ",289.16000000000003,8,202.41200000000001]
["78TFBS916E","Eye to Swage TFB 9/16\"Wire 7/8\" Eye  ",773.75,8,541.625]
["1TFBS58E","Eye to Swage TFB 5/8\"Wire 1.0\" Eye ",1136.0899999999999,8,795.26299999999992]
[null,null,null,null,""]
["Rigging Turnbuckles - Eye to Swage (Forged Bronze TFBS Series) - Metric Wire Sizes",null,null,null,""]
["14TFBSM03E","Eye to Swage TFB 3mm Wire 1/4\" Eye ",39.200000000000003,8,27.44]
["14TFBSM03EB","Eye to Swage TFB 3mm Wire 1/4\" Eye-UC",37.549999999999997,8,26.284999999999997]
["14TFBSM04E","Eye to Swage TFB 4mm Wire 1/4\" Eye       ",42.19,8,29.532999999999998]
["14TFBSM04EB","Eye to Swage TFB 4mm Wire 1/4\" Eye-UC    ",40.54,8,{"$f":"IF(ISBLANK(C201),\"\",C201*$E$5)","v":28.377999999999997}]
["516TFBSM04E","Eye to Swage TFB 4mm Wire 5/16\" Eye      ",52.08,8,36.455999999999996]
["516TFBSM04EB","Eye to Swage TFB 4mm Wire 5/16\" Eye-UC ",50.44,8,35.307999999999993]
["516TFBSM05E","Eye to Swage TFB 5mm Wire 5/16\" Eye      ",52.08,8,36.455999999999996]
["516TFBSM05EB","Eye to Swage TFB 5mm Wire 5/16\" Eye-UC",50.44,8,35.307999999999993]
["38TFBSM05E","Eye to Swage TFB 5mm Wire 3/8\" Eye       ",60.8,8,42.559999999999995]
["38TFBSM05EB","Eye to Swage TFB 5mm Wire 3/8\" Eye-UC   ",59.17,8,41.418999999999997]
["38TFBSM06E","Eye to Swage TFB 6mm Wire 3/8\" Eye       ",67.61,8,47.326999999999998]
["38TFBSM06EB","Eye to Swage TFB 6mm Wire 3/8\" Eye-UC   ",65.989999999999995,8,46.192999999999991]
["12TFBSM06E","Eye to Swage TFB 6mm Wire 1/2\" Eye       ",93.18,8,65.225999999999999]
["12TFBSM06EB","Eye to Swage TFB 6mm Wire 1/2\" Eye-UC   ",89.93,8,62.951000000000001]
["12TFBSM07E","Eye to Swage TFB 7mm Wire 1/2\" Eye       ",100.96,8,70.671999999999997]
["12TFBSM07EB","Eye to Swage TFB 7mm Wire 1/2\" Eye-UC      ",97.71,8,68.396999999999991]
["12TFBSM08E","Eye to Swage TFB 8mm Wire 1/2\" Eye       ",106.25,8,74.375]
["12TFBSM08EB","Eye to Swage TFB 8mm Wire 1/2\" Eye-UC    ",102.99,8,72.092999999999989]
["58TFBSM08E","Eye to Swage TFB 8mm Wire 5/8\" Eye      ",152.68,8,106.876]
["58TFBSM08EB","Eye to Swage TFB 8mm Wire 5/8\" Eye-UC     ",149.44,8,104.60799999999999]
["58TFBSM10E","Eye to Swage TFB 10mm Wire 5/8\" Eye      ",161.69,8,113.18299999999999]
["58TFBSM10EB","Eye to Swage TFB 10mm Wire 5/8\" Eye-UC    ",158.44999999999999,8,110.91499999999999]
["34TFBSM12E","Eye to Swage TFB 12mm Wire 3/4\" Eye      ",294.04000000000002,8,205.828]
["34TFBSM12EB","Eye to Swage TFB 12mm Wire 3/4\" Eye-UC      ",289.16000000000003,8,202.41200000000001]
["78TFBSM14E","Eye to Swage TFB 14mm Wire 7/8\" Eye      ",773.75,8,541.625]
["1TFBSM16E","Eye to Swage TFB 16mm Wire 1.0\" Eye      ",1136.0899999999999,8,795.26299999999992]
[null,null,null,null,""]
["Rigging Turnbuckles - Swage to Swage (Forged Bronze TFBSS Series) - Imperial Wire Sizes",null,null,null,""]
["14TFBS332SS","Swage to Swage TFB 3/32\" Wire 1/4-28 Thd ",37.700000000000003,9,26.39]
["14TFBS332SSB","Swage to Swage TFB 3/32\" Wire 1/4-28-UC  ",36.06,9,25.242000000000001]
["14TFBS18SS","Swage to Swage TFB 1/8\" Wire 1/4-28 Thd  ",37.74,9,26.417999999999999]
["14TFBS18SSB","Swage to Swage TFB 1/8\" Wire 1/4-28-UC   ",36.11,9,25.276999999999997]
["14TFBS532SS","Swage to Swage TFB 5/32\" Wire 1/4-28 Thd ",43.72,9,30.603999999999996]
["14TFBS532SSB","Swage to Swage TFB 5/32\" Wire 1/4-28-UC  ",42.09,9,29.463000000000001]
["516TFBS532SS","Swage to Swage TFB 5/32\" Wire 5/16-18 Thd",51.49,9,36.042999999999999]
["516TFBS532SSB","Swage to Swage TFB 5/32\" Wire 5/16-18-UC ",49.85,9,34.894999999999996]
["516TFBS316SS","Swage to Swage TFB 3/16\" Wire 5/16-24 Thd",54.5,9,38.15]
["516TFBS316SSB","Swage to Swage TFB 3/16\" Wire 5/16-24-UC ",52.85,9,36.994999999999997]
["38TFBS316SS","Swage to Swage TFB 3/16\" Wire 3/8-24 Thd ",59.46,9,41.622]
["38TFBS316SSB","Swage to Swage TFB 3/16\" Wire 3/8-24-UC  ",57.83,9,40.480999999999995]
["38TFBS732SS","Swage to Swage TFB 7/32\" Wire 3/8-24 Thd ",72.05,9,50.434999999999995]
["38TFBS732SSB","Swage to Swage TFB 7/32\" Wire 3/8-24-UC  ",70.430000000000007,9,49.301000000000002]
["38TFBS14SS","Swage to Swage TFB 1/4\" Wire 3/8-24 Thd  ",73.11,9,51.177]
["38TFBS14SSB","Swage to Swage TFB 1/4\" Wire 3/8-24-UC   ",71.489999999999995,9,50.042999999999992]
["12TFBS14SS","Swage to Swage TFB 1/4\" Wire 1/2-20 Thd  ",89.93,9,62.951000000000001]
["12TFBS14SSB","Swage to Swage TFB 1/4\" Wire 1/2-20-UC   ",86.67,9,60.668999999999997]
["12TFBS932SS","Swage to Swage TFB 9/32\" Wire 1/2-20 Thd ",105.5,9,73.849999999999994]
["12TFBS932SSB","Swage to Swage TFB 9/32\" Wire 1/2-20-UC  ",102.24,9,71.567999999999998]
["12TFBS516SS","Swage to Swage TFB 5/16\" Wire 1/2-20 Thd ",116.07,9,81.248999999999995]
["12TFBS516SSB","Swage to Swage TFB 5/16\" Wire 1/2-20-UC  ",112.82,9,78.97399999999999]
["58TFBS516SS","Swage to Swage TFB 5/16\" Wire 5/8-18 Thd ",146.62,9,102.634]
["58TFBS516SSB","Swage to Swage TFB 5/16\" Wire 5/8-18-UC  ",143.38,9,100.36599999999999]
["58TFBS38SS","Swage to Swage TFB 3/8\" Wire 5/8-18 Thd  ",164.64,9,115.24799999999998]
["58TFBS38SSB","Swage to Swage TFB 3/8\" Wire 5/8-18-UC   ",161.4,9,112.97999999999999]
["34TFBS716SS","Swage to Swage TFB 7/16\" Wire 3/4-16 Thd ",281.94,9,197.35799999999998]
["34TFBS716SSB","Swage to Swage TFB 7/16\" Wire 3/4-16-UC  ",277.05,9,193.935]
["34TFBS12SS","Swage to Swage TFB 1/2\" Wire 3/4-16 Thd  ",319.51,9,223.65699999999998]
["34TFBS12SSB","Swage to Swage TFB 1/2\" Wire 3/4-16-UC   ",314.62,9,220.23399999999998]
["78TFBS12SS","Swage to Swage TFB 1/2\" Wire 7/8-14 Thd",796.41,9,557.48699999999997]
["78TFBS916SS","Swage to Swage TFB 9/16\" Wire 7/8-14 Thd",843.23,9,590.26099999999997]
["1TFBS916SS","Swage to Swage TFB 9/16\" Wire 1.0-12 Thd",1165.58,9,815.90599999999995]
["1TFBS58SS","Swage to Swage TFB 5/8\" Wire 1.0-12 Thd",1195.4000000000001,9,836.78]
[null,null,null,null,""]
["Rigging Turnbuckles - Eye to Eye (Forged Bronze TFB Series)",null,null,null,""]
["14TFBEE","Eye to Eye TFB 1/4\" Pin 1/4-28 Thd    ",40.64,9,28.447999999999997]
["14TFBEEB","Eye to Eye TFB 1/4\" Pin 1/4-28 Thd-UC",39.01,9,27.306999999999999]
["516TFBEE","Eye to Eye TFB 5/16\" Pin 5/16-24 Thd ",49.68,9,34.775999999999996]
["516TFBEEB","Eye to Eye TFB 5/16\" Pin 5/16-24 Thd-UC ",48.04,9,{"$f":"IF(ISBLANK(C265),\"\",C265*$E$5)","v":33.628}]
["38TFBEE","Eye to Eye TFB 3/8\" Pin 3/8-24 Thd  ",62.12,9,43.483999999999995]
["38TFBEEB","Eye to Eye TFB 3/8\" Pin 3/8-24 Thd-UC ",60.5,9,42.349999999999994]
["12TFBEE","Eye to Eye TFB 1/2\" Pin 1/2-20 Thd  ",96.43,9,67.501000000000005]
["12TFBEEB","Eye to Eye TFB 1/2\" Pin 1/2-20 Thd-UC ",93.17,9,65.218999999999994]
["58TFBEE","Eye to Eye TFB 5/8\" Pin 5/8-18 Thd    ",158.74,9,111.11799999999999]
["58TFBEEB","Eye to Eye TFB 5/8\" Pin 5/8-18 Thd-UC  ",155.49,9,108.843]
["34TFBEE","Eye to Eye TFB 3/4\" Pin 3/4-16 Thd",268.57,9,187.999]
["34TFBEEB","Eye to Eye TFB 3/4\" Pin 3/4-16 Thd-UC ",263.69,9,184.583]
["78TFBEE","Eye to Eye TFB 7/8\" Pin 7/8-14 Thd",704.27,9,492.98899999999998]
["1TFBEE","Eye to Eye TFB 1.0\" Pin 1.0-12 Thd ",1076.77,9,753.73899999999992]
[null,null,null,null,""]
["Rigging Turnbuckles - Left Hand Jaw and Body Only ( T Bolt )(Forged Bronze FBJ Series)",null,null,null,""]
["14FBJ","LH Jaw and Body FBJ 1/4\"Jaw 1/4\" Pin     ",29.81,10,20.866999999999997]
["14FBJB","LH Jaw and Body FBJ 1/4\"Jaw 1/4\" Pin-UC  ",28.17,10,19.719000000000001]
["516FBJ","LH Jaw and Body FBJ 5/16\"Jaw 5/16\" Pin   ",45.9,10,32.129999999999995]
["516FBJB","LH Jaw and Body FBJ 5/16\"Jaw 5/16\" Pin-UC",44.24,10,30.968]
["38FBJ","LH Jaw and Body FBJ 3/8\"Jaw 3/8\" Pin     ",56.96,10,39.872]
["38FBJB","LH Jaw and Body FBJ 3/8\"Jaw 3/8\" Pin-UC  ",55.33,10,38.730999999999995]
["12FBJ","LH Jaw and Body FBJ 1/2\"Jaw 1/2\" Pin     ",90.22,10,63.153999999999996]
["12FBJB","LH Jaw and Body FBJ 1/2\"Jaw 1/2\" Pin-UC  ",86.96,10,60.871999999999993]
["58FBJ","LH Jaw and Body FBJ 5/8\"Jaw 5/8\" Pin     ",140.43,10,98.301000000000002]
["58FBJB","LH Jaw and Body FBJ 5/8\"Jaw 5/8\" Pin-UC  ",137.19999999999999,10,96.039999999999992]
["34FBJ","LH Jaw and Body FBJ 3/4\"Jaw 3/4\" Pin     ",212.18,10,148.52599999999998]
["34FBJB","LH Jaw and Body FBJ 3/4\"Jaw 3/4\" Pin-UC  ",212.18,10,148.52599999999998]
[null,null,null,null,""]
["Rigging Turnbuckles - Left Hand Eye Toggle and Body Only (Forged Bronze ETFB Series)",null,null,null,""]
["14EFBJ","LH Eye Toggle & Body TFB 1/4\" Jaw 1/4\" Pin   ",28.67,10,20.068999999999999]
["14EFBJB","LH Eye Toggle & Body TFB 1/4\" Jaw 1/4\" Pin-UC   ",28.67,10,20.068999999999999]
["516EFBJ","LH Eye Toggle & Body TFB 5/16\" Jaw 5/16\" Pin ",36.700000000000003,10,25.69]
["516EFBJB","LH Eye Toggle & Body TFB 5/16\" Jaw 5/16\" Pin-UC ",36.700000000000003,10,25.69]
["38EFBJ","LH Eye Toggle & Body TFB 3/8\" Jaw 3/8\" Pin   ",51.6,10,36.119999999999997]
["38EFBJB","LH Eye Toggle & Body TFB 3/8\" Jaw 3/8\" Pin-UC  ",51.6,10,36.119999999999997]
["12EFBJ","LH Eye Toggle & Body TFB 1/2\" Jaw 1/2\" Pin   ",71.099999999999994,10,{"$f":"IF(ISBLANK(C298),\"\",C298*$E$5)","v":49.769999999999996}]
["12EFBJB","LH Eye Toggle & Body TFB 1/2\" Jaw 1/2\" Pin-UC   ",71.099999999999994,10,49.769999999999996]
["58EFBJ","LH Eye Toggle & Body TFB 5/8\" Jaw 5/8\" Pin   ",120.43,10,84.301000000000002]
["58EFBJB","LH Eye Toggle & Body TFB 5/8\" Jaw 5/8\" Pin-UC   ",120.43,10,84.301000000000002]
["34EFBJ","LH Eye Toggle & Body TFB 3/4\" Jaw 3/4\" Pin   ",288.54000000000002,10,201.97800000000001]
["34EFBJB","LH Eye Toggle & Body TFB 3/4\" Jaw 3/4\" Pin-UC   ",288.54000000000002,10,201.97800000000001]
["78EFBJ","LH Eye Toggle & Body TFB 7/8\" Jaw 7/8\" Pin   ",802.86,10,562.00199999999995]
["1EFBJ","LH Eye Toggle & Body TFB 1\" Jaw 1\" Pin   ",1146.93,10,802.851]
[null,null,null,null,""]
["Rigging Turnbuckles - Jaw to Jaw ( T BOLT )(Tubular Turnbuckle TTJ Series)",null,null,null,""]
["10TTJ","Jaw to Jaw TTJ 1/4\" Jaw 3/16\" Pin          ",22.35,11,15.645]
["14TTJ","Jaw to Jaw TTJ 1/4\" Jaw 1/4\" Pin           ",33.32,11,23.323999999999998]
["516TTJ","Jaw to Jaw TTJ 5/16\" Jaw 5/16\" Pin         ",55.3,11,38.709999999999994]
["38TTJ","Jaw to Jaw TTJ 3/8\" Jaw 3/8\" Pin           ",72.94,11,51.057999999999993]
["12TTJ","Jaw to Jaw TTJ 1/2\" Jaw 1/2\" Pin           ",139.87,11,97.908999999999992]
["58TTJ","Jaw to Jaw TTJ 5/8\" Jaw 5/8\" Pin           ",245.26,11,171.68199999999999]
["34TTJ","Jaw to Jaw TTJ 3/4\" Jaw 3/4\" Pin           ",372.76,11,260.93199999999996]
[null,null,null,null,""]
["Rigging Turnbuckles - Eye Toggle to Eye Toggle (Tubular Turnbuckle ETTJ Series)",null,null,null,""]
["14ETTJ","Eye Toggle to Eye Toggle ETTJ 1/4\"J AW 1/4\" Pin           ",36.700000000000003,11,25.69]
["516ETTJ","Eye Toggle to Eye Toggle ETTJ 5/16\" Jaw 5/16\"Pin         ",59.62,11,41.733999999999995]
["38ETTJ","Eye Toggle to Eye Toggle ETTJ 3/8\"Jaw 3/8\" Pin           ",77.84,11,54.488]
["12ETTJ","Eye Toggle to Eye Toggle ETTJ 1/2\" Jaw 1/2\" Pin           ",152.28,11,106.59599999999999]
["58ETTJ","Eye Toggle to Eye Toggle ETTJ 5/8\" Jaw 5/8\" Pin           ",281.25,11,196.875]
["34ETTJ","Eye Toggle to Eye Toggle ETTJ 3/4\" Jaw 3/4\" Pin           ",615.13,11,430.59099999999995]
["78ETTJ","Eye Toggle to Eye Toggle ETTJ 7/8\" Jaw 7/8\" Pin           ",1201.08,11,840.75599999999986]
["1ETTJ","Eye Toggle to Eye Toggle ETTJ 1.0\" Jaw 1.0\" Pin           ",1403.82,11,982.67399999999986]
[null,null,null,null,""]
["Rigging Turnbuckles - Jaw to Swage ( T BOLT )(Tubular Turnbuckle TTS Series) - Imperial Wire Sizes",null,null,null,""]
["10TTS116","Jaw to Swage TTS 1/16\" Wire 3/16\" Pin      ",28.75,12,20.125]
["10TTS332","Jaw to Swage TTS 3/32\" Wire 3/16\" Pin      ",28.75,12,20.125]
["10TTS18","Jaw to Swage TTS 1/8\" Wire 3/16\" Pin       ",28.75,12,{"$f":"IF(ISBLANK(C329),\"\",C329*$E$5)","v":20.125}]
["14TTS332","Jaw to Swage TTS 3/32\" Wire 1/4\" Pin       ",32.409999999999997,12,22.686999999999998]
["14TTS18","Jaw to Swage TTS 1/8\" Wire 1/4\" Pin        ",32.44,12,22.707999999999998]
["14TTS532","Jaw to Swage TTS 5/32\" Wire 1/4\" Pin       ",35.43,12,24.800999999999998]
["516TTS532","Jaw to Swage TTS 5/32\" Wire 5/16\" Pin      ",48.92,12,34.244]
["516TTS316","Jaw to Swage TTS 3/16\" Wire 5/16\" Pin      ",50.43,12,35.300999999999995]
["38TTS316","Jaw to Swage TTS 3/16\" Wire 3/8\" Pin       ",69.260000000000005,12,48.481999999999999]
["38TTS732","Jaw to Swage TTS 7/32\" Wire 3/8\" Pin       ",68.73,12,48.110999999999997]
["38TTS14","Jaw to Swage TTS 1/4\" Wire 3/8\" Pin        ",69.260000000000005,12,48.481999999999999]
["12TTS14","Jaw to Swage TTS 1/4\" Wire 1/2\" Pin        ",114.69,12,80.282999999999987]
["12TTS932","Jaw to Swage TTS 9/32\" Wire 1/2\" Pin       ",115.84,12,81.087999999999994]
["12TTS516","Jaw to Swage TTS 5/16\" Wire 1/2\" Pin       ",120.43,12,84.301000000000002]
["58TTS516","Jaw to Swage TTS 5/16\" Wire 5/8\" Pin     ",168.6,12,118.01999999999998]
["58TTS38","Jaw to Swage TTS 3/8\" Wire 5/8\" Pin      ",189.25,12,132.47499999999999]
["34TTS716","Jaw to Swage TTS 7/16\" Wire 3/4\" Pin     ",309.67,12,216.76900000000001]
["34TTS12","Jaw to Swage TTS 1/2\" Wire 3/4\" Pin      ",315.41000000000003,12,220.78700000000001]
[null,null,null,null,""]
["Rigging Turnbuckles - Jaw to Swage ( T BOLT )(Tubular Turnbuckle TTS Series) - Metric Wire Sizes",null,null,null,""]
["14TTSM03","Jaw to Swage TTS 3mm Wire 1/4\" Pin        ",32.44,12,22.707999999999998]
["14TTSM04","Jaw to Swage TTS 4mm Wire 1/4\" Pin",35.43,12,24.800999999999998]
["516TTSM04","Jaw to Swage TTS 4mm Wire 5/16\" Pin",48.92,12,34.244]
["516TTSM05","Jaw to Swage TTS 5mm Wire 5/16\" Pin       ",50.43,12,35.300999999999995]
["38TTSM05","Jaw to Swage TTS 5mm Wire 3/8\" Pin        ",68.739999999999995,12,48.117999999999995]
["38TTSM06","Jaw to Swage TTS 6mm Wire 3/8\" Pin        ",69.260000000000005,12,48.481999999999999]
["12TTSM06","Jaw to Swage TTS 6mm Wire 1/2\" Pin        ",114.69,12,80.282999999999987]
["12TTSM07","Jaw to Swage TTS 7mm Wire 1/2\" Pin",115.84,12,81.087999999999994]
["12TTSM08","Jaw to Swage TTS 8mm Wire 1/2\" Pin",120.43,12,84.301000000000002]
["58TTSM08","Jaw to Swage TTS 8mm Wire 5/8\" Pin",168.6,12,118.01999999999998]
["58TTSM10","Jaw to Swage TTS 10mm Wire 5/8\" Pin      ",189.25,12,132.47499999999999]
["34TTSM11","Jaw to Swage TTS 11mm Wire 3/4\" Pin      ",309.67,12,216.76900000000001]
["34TTSM12","Jaw to Swage TTS 12mm Wire 3/4\" Pin      ",315.41000000000003,12,220.78700000000001]
[null,null,null,null,""]
["Rigging Turnbuckles - Eye Toggle to Swage (Tubular Turnbuckle ETTS Series) - Imperial Wire Sizes",null,null,null,""]
["14ETTS332","Eye Toggle to Swage ETTS 3/32\" Wire 1/4\"Pin       ",40.01,13,28.006999999999998]
["14ETTS18","Eye Toggle to Swage ETTS 1/8\" Wire 1/4\"Pin        ",40.03,13,28.020999999999997]
["14ETTS532","Eye Toggle to Swage ETTS 5/32\" Wire 1/4\"Pin       ",43.02,13,30.114000000000001]
["516ETTS532","Eye Toggle to Swage ETTS 5/32\" Wire 5/16\"Pin      ",51.08,13,35.755999999999993]
["516ETTS316","Eye Toggle to Swage ETTS 3/16\" Wire 5/16\"Pin      ",52.59,13,36.813000000000002]
["38ETTS316","Eye Toggle to Swage ETTS 3/16\" Wire 3/8\"Pin       ",64.89,13,45.422999999999995]
["38ETTS732","Eye Toggle to Swage ETTS 7/32\" Wire 3/8\"Pin       ",71.19,13,49.832999999999998]
["38ETTS14","Eye Toggle to Swage ETTS 1/4\" Wire 3/8\"Pin        ",71.72,13,50.203999999999994]
["12ETTS14","Eye Toggle to Swage ETTS 1/4\" Wire 1/2\"Pin        ",124.88,13,87.415999999999997]
["12ETTS932","Eye Toggle to Swage ETTS 9/32\" Wire 1/2\"Pin       ",132.66999999999999,13,92.868999999999986]
["12ETTS516","Eye Toggle to Swage ETTS 5/16\" Wire 1/2\"Pin       ",137.96,13,96.572000000000003]
["58ETTS516","Eye Toggle to Swage ETTS 5/16\" Wire 5/8\" Pin     ",191.54,13,134.07799999999997]
["58ETTS38","Eye Toggle to Swage ETTS 3/8\" Wire 5/8\" Pin      ",206.45,13,144.51499999999999]
["34ETTS716","Eye Toggle to Swage ETTS 7/16\" Wire 3/4\" Pin     ",378.5,13,264.95]
["34ETTS12","Eye Toggle to Swage ETTS 1/2\" Wire 3/4\" Pin      ",401.43,13,281.00099999999998]
["78ETTS12","Eye Toggle to Swage ETTS 1/2\" Wire 7/8\" Pin",716.84,13,501.78800000000001]
["78ETTS916","Eye Toggle to Swage ETTS 9/16\" Wire 7/8\" Pin",825.79,13,578.05299999999988]
["1ETTS916","Eye Toggle to Swage ETTS 9/16\" Wire 1.0\" Pin",1101.06,13,770.74199999999996]
["1ETTS58","Eye Toggle to Swage ETTS 5/8\" Wire 1.0\" Pin",1118.26,13,782.78199999999993]
[null,null,null,null,""]
["Rigging Turnbuckles - Eye Toggle to Swage (Tubular Turnbuckle ETTS Series) - Metric Wire Sizes",null,null,null,""]
["14ETTSM03","Eye Toggle to Swage ETTS 3mm Wire 1/4\"Pin        ",40.03,13,28.020999999999997]
["14ETTSM04","Eye Toggle to Swage ETTS 4mm Wire 1/4\"Pin",43.02,13,30.114000000000001]
["516ETTSM04","Eye Toggle to Swage ETTS 4mm Wire 5/16\"Pin",51.1,13,35.769999999999996]
["516ETTSM05","Eye Toggle to Swage ETTS 5mm Wire 5/16\"Pin       ",52.58,13,36.805999999999997]
["38ETTSM05","Eye Toggle to Swage ETTS 5mm Wire 3/8\"Pin        ",64.89,13,45.422999999999995]
["38ETTSM06","Eye Toggle to Swage ETTS 6mm Wire 3/8\"Pin        ",71.72,13,50.203999999999994]
["12ETTSM06","Eye Toggle to Swage ETTS 6mm Wire 1/2\"Pin        ",124.88,13,87.415999999999997]
["12ETTSM07","Eye Toggle to Swage ETTS 7mm Wire 1/2\"Pin",132.66999999999999,13,92.868999999999986]
["12ETTSM08","Eye Toggle to Swage ETTS 8mm Wire 1/2\" Pin",137.96,13,96.572000000000003]
["58ETTSM08","Eye Toggle to Swage ETTS 8mm Wire 5/8\" Pin",191.54,13,134.07799999999997]
["58ETTSM10","Eye Toggle to Swage ETTS 10mm Wire 5/8\" Pin      ",206.45,13,{"$f":"IF(ISBLANK(C393),\"\",C393*$E$5)","v":144.51499999999999}]
["34ETTSM11","Eye Toggle to Swage ETTS 11mm Wire 3/4\" Pin",378.5,13,264.95]
["34ETTSM12","Eye Toggle to Swage ETTS 12mm Wire 3/4\" Pin      ",401.43,13,281.00099999999998]
["78ETTSM12","Eye Toggle to Swage ETTS 12mm Wire 7/8\" Pin      ",716.84,13,501.78800000000001]
["78ETTSM14","Eye Toggle to Swage ETTS 14mm Wire 7/8\" Pin",825.79,13,578.05299999999988]
["1ETTSM16","Eye Toggle to Swage ETTS 16mm Wire 1.0\" Pin",1118.26,13,782.78199999999993]
[null,null,null,null,""]
["Rigging Turnbuckles - Swage to Swage (Tubular Turnbuckle TTSS Series) - Imperial Wire Sizes",null,null,null,""]
["10TTS332SS","Swage to Swage TT 3/32\"Wire 10-32 Thd   ",28.64,14,20.047999999999998]
["10TTS18SS","Swage to Swage TT 1/8\"Wire 10-32 Thd    ",33.369999999999997,14,23.358999999999998]
["14TTS332SS","Swage to Swage TT 3/32\"Wire 1/4-28 Thd  ",30.89,14,21.622999999999998]
["14TTS18SS","Swage to Swage TT 1/8\"Wire 1/4-28 Thd   ",30.93,14,21.651]
["14TTS532SS","Swage to Swage TT 5/32\"Wire 1/4-28 Thd  ",36.799999999999997,14,25.759999999999998]
["516TTS532SS","Swage to Swage TT 5/32\"Wire 5/16-24 Thd ",41.72,14,29.203999999999997]
["516TTS316SS","Swage to Swage TT 3/16\"Wire 5/16-24 Thd ",44.66,14,31.261999999999997]
["38TTS316SS","Swage to Swage TT 3/16\"Wire 3/8-24 Thd  ",50.92,14,35.643999999999998]
["38TTS732SS","Swage to Swage TT 7/32\"Wire 3/8-24 Thd  ",63.26,14,44.281999999999996]
["38TTS14SS","Swage to Swage TT 1/4\"Wire 3/8-24 Thd   ",64.3,14,45.01]
["12TTS14SS","Swage to Swage TT 1/4\"Wire 1/2-20 Thd   ",97.5,14,68.25]
["12TTS932SS","Swage to Swage TT 9/32\"Wire 1/2-20 Thd  ",113.07,14,79.148999999999987]
["12TTS516SS","Swage to Swage TT 5/16\"Wire 1/2-20 Thd  ",123.65,14,86.554999999999993]
["58TTS516SS","Swage to Swage TT 5/16\"Wire 5/8-18 Thd  ",185.46,14,129.822]
["58TTS38SS","Swage to Swage TT 3/8\"Wire 5/8-18 Thd   ",203.49,14,142.44299999999998]
["34TTS716SS","Swage to Swage TT 7/16\"Wire 3/4-16 Thd  ",423.44,14,296.40799999999996]
["34TTS12SS","Swage to Swage TT 1/2\"Wire 3/4-16 Thd   ",461.01,14,322.70699999999999]
["78TTS12SS","Swage to Swage TT 1/2\"Wire 7/8-14 Thd   ",604.62,14,423.23399999999998]
["78TTS916SS","Swage to Swage TT 9/16\"Wire 7/8-14 Thd   ",651.46,14,456.02199999999999]
["1TTS916SS","Swage to Swage TT 9/16\"Wire 1.0-12 Thd   ",1006.63,14,704.64099999999996]
["1TTS58SS","Swage to Swage TT 5/8\"Wire 1.0-12 Thd   ",1036.44,14,725.50800000000004]
[null,null,null,null,""]
["Rigging Turnbuckles - Eye to Eye (Tubular Turnbuckle TT Series)",null,null,null,""]
["14TTEE","Eye to Eye TT 1/4\" Pin 1/4-28 Thd       ",34.44,14,24.107999999999997]
["516TTEE","Eye to Eye TT 5/16\" Pin 5/16-24 Thd     ",40.75,14,28.524999999999999]
["38TTEE","Eye to Eye TT 3/8\" Pin 3/8-24 Thd       ",54.6,14,38.22]
["12TTEE","Eye to Eye TT 1/2\" Pin 1/2-20 Thd       ",104,14,72.8]
["58TTEE","Eye to Eye TT 5/8\" Pin 5/8-18 Thd       ",197.58,14,138.30600000000001]
["34TTEE","Eye to Eye TT 3/4\" Pin 3/4-16 Thd       ",410.08,14,287.05599999999998]
["78TTEE","Eye to Eye TT 7/8\" Pin 7/8-14 Thd       ",512.48,14,358.73599999999999]
["1TTEE","Eye to Eye TT 1.0\" Pin 1.0-12 Thd       ",883.42,14,618.39399999999989]
[null,null,null,null,""]
["Rigging Turnbuckles - Jaw to Eye ( T BOLT )(Tubular Turnbuckle TT Series)",null,null,null,""]
["14TTJE","Jaw to Eye TT 1/4\" Jaw - 1/4\" Eye",33.880000000000003,15,23.716000000000001]
["516TTJE","Jaw to Eye TT 5/16\" Jaw - 5/16\" Eye",48.03,15,33.620999999999995]
["38TTJE","Jaw to Eye TT 3/8\" Jaw - 3/8\" Eye",63.76,15,44.631999999999998]
["12TTJE","Jaw to Eye TT 1/2\" Jaw - 1/2\" Eye",121.94,15,85.35799999999999]
["58TTJE","Jaw to Eye TT 5/8\" Jaw - 5/8\" Eye",221.42,15,154.99399999999997]
["34TTJE","Jaw to Eye TT 3/4\" Jaw - 3/4\" Eye       ",509.57,15,356.69899999999996]
[null,null,null,null,""]
["Rigging Turnbuckles - Eye Toggle to Eye (Tubular Turnbuckle ETT Series)",null,null,null,""]
["14ETTJE","Eye Toggle to Eye TT 1/4\" Jaw - 1/4\" Eye",41.49,15,29.042999999999999]
["516ETTJE","Eye Toggle to Eye TT 5/16\" Jaw - 5/16\" Eye",50.19,15,35.132999999999996]
["38ETTJE","Eye Toggle to Eye TT 3/8\" Jaw - 3/8\" Eye",66.23,15,46.360999999999997]
["12ETTJE","Eye Toggle to Eye TT 1/2\" Jaw - 1/2\" Eye",128.15,15,89.704999999999998]
["58ETTJE","Eye Toggle to Eye TT 5/8\" Jaw - 5/8\" Eye",239.41,15,167.58699999999999]
["34ETTJE","Eye Toggle to Eye TT 3/4\" Jaw - 3/4\" Eye       ",512.6,15,358.82]
["78ETTJE","Eye Toggle to Eye TT 7/8\" Jaw - 7/8\" Eye       ",832.7,15,582.89]
[null,null,null,null,""]
["Rigging Turnbuckles - Eye to Swage (Tubular Turnbuckle TT Series) - Imperial Wire Sizes",null,null,null,""]
["10TTS116E","Eye to Swage TT 1/16\"Wire 3/16\" Eye     ",32.229999999999997,16,22.560999999999996]
["10TTS332E","Eye to Swage TT 3/32\"Wire 3/16\" Eye     ",32.229999999999997,16,22.560999999999996]
["10TTS18E","Eye to Swage TT 1/8\"Wire 3/16\" Eye      ",32.229999999999997,16,22.560999999999996]
["14TTS332E","Eye to Swage TT 3/32\"Wire 1/4\" Eye      ",32.97,16,23.078999999999997]
["14TTS18E","Eye to Swage TT 1/8\"Wire 1/4\" Eye       ",33,16,23.099999999999998]
["14TTS532E","Eye to Swage TT 5/32\"Wire 1/4\" Eye      ",35.99,16,25.193000000000001]
["516TTS532E","Eye to Swage TT 5/32\"Wire 5/16\" Eye     ",41.65,16,{"$f":"IF(ISBLANK(C457),\"\",C457*$E$5)","v":29.154999999999998}]
["516TTS316E","Eye to Swage TT 3/16\"Wire 5/16\" Eye     ",43.15,16,30.204999999999998]
["38TTS316E","Eye to Swage TT 3/16\"Wire 3/8\" Eye      ",53.27,16,37.289000000000001]
["38TTS732E","Eye to Swage TT 7/32\"Wire 3/8\" Eye      ",59.56,16,41.692]
["38TTS14E","Eye to Swage TT 1/4\"Wire 3/8\" Eye       ",60.09,16,42.063000000000002]
["12TTS14E","Eye to Swage TT 1/4\"Wire 1/2\" Eye       ",100.76,16,70.531999999999996]
["12TTS932E","Eye to Swage TT 9/32\"Wire 1/2\" Eye      ",108.54,16,75.977999999999994]
["12TTS516E","Eye to Swage TT 5/16\"Wire 1/2\" Eye      ",113.83,16,79.680999999999997]
["58TTS516E","Eye to Swage TT 5/16\"Wire 5/8\" Eye      ",191.52,16,134.06399999999999]
["58TTS38E","Eye to Swage TT 3/8\"Wire 5/8\" Eye       ",200.52,16,140.364]
["34TTS716E","Eye to Swage TT 7/16\"Wire 3/4\" Eye      ",416.76,16,291.73199999999997]
["34TTS12E","Eye to Swage TT 1/2\"Wire 3/4\" Eye       ",435.54,16,304.87799999999999]
["78TTS12E","Eye to Swage TT 1/2\"Wire 7/8\" Eye       ",558.54999999999995,16,390.98499999999996]
["78TTS916E","Eye to Swage TT 9/16\"Wire 7/8\" Eye      ",581.96,16,407.37200000000001]
["1TTS916E","Eye to Swage TT 9/16\"Wire 1.0\" Eye      ",962.22,16,673.55399999999997]
["1TTS58E","Eye to Swage TT 5/8\"Wire 1.0\" Eye      ",977.13,16,683.99099999999999]
[null,null,null,null,""]
["Rigging Turnbuckles - Eye to Swage (Tubular Turnbuckle TT Series) - Metric Wire Sizes",null,null,null,""]
["14TTSM03E","Eye to Swage TT 3mm Wire 1/4\" Eye       ",33,16,23.099999999999998]
["14TTSM04E","Eye to Swage TT 4mm Wire 1/4\" Eye       ",35.99,16,25.193000000000001]
["516TTSM04E","Eye to Swage TT 4mm Wire 5/16\" Eye      ",43.15,16,30.204999999999998]
["516TTSM05E","Eye to Swage TT 5mm Wire 5/16\" Eye      ",43.15,16,30.204999999999998]
["38TTSM05E","Eye to Swage TT 5mm Wire 3/8\" Eye       ",53.27,16,37.289000000000001]
["38TTSM06E","Eye to Swage TT 6mm Wire 3/8\" Eye       ",60.09,16,42.063000000000002]
["12TTSM06E","Eye to Swage TT 6mm Wire 1/2\" Eye       ",100.76,16,70.531999999999996]
["12TTSM07E","Eye to Swage TT 7mm Wire 1/2\" Eye       ",108.54,16,75.977999999999994]
["12TTSM08E","Eye to Swage TT 8mm Wire 1/2\" Eye       ",113.83,16,79.680999999999997]
["58TTSM08E","Eye to Swage TT 8mm Wire 5/8\" Eye      ",191.52,16,134.06399999999999]
["58TTSM10E","Eye to Swage TT 10mm Wire 5/8\" Eye      ",200.52,16,140.364]
["34TTSM12E","Eye to Swage TT 12mm Wire 3/4\" Eye      ",435.54,16,304.87799999999999]
["78TTSM14E","Eye to Swage TT 14mm Wire 7/8\" Eye      ",581.96,16,407.37200000000001]
["1TTSM16E","Eye to Swage TT 16mm Wire 1.0\" Eye      ",977.13,16,683.99099999999999]
[null,null,null,null,""]
["Rigging Turnbuckles - Left Hand Jaw and Body Only ( T BOLT )(Tubular Turnbuckle TT Series)",null,null,null,""]
["10TTJT","LH Jaw and Body TT 1/4\"Jaw 3/16\"Pin     ",19.399999999999999,17,13.579999999999998]
["14TTJT","LH Jaw and Body TT 1/4\"Jaw 1/4\"Pin      ",23.31,17,16.316999999999997]
["516TTJT","LH Jaw and Body TT 5/16\"Jaw 5/16\"Pin    ",36.590000000000003,17,25.613]
["38TTJT","LH Jaw and Body TT 3/8\"Jaw 3/8\"Pin      ",49.03,17,34.320999999999998]
["12TTJT","LH Jaw and Body TT 1/2\"Jaw 1/2\"Pin      ",95.3,17,66.709999999999994]
["58TTJT","LH Jaw and Body TT 5/8\"Jaw 5/8\"Pin      ",128.44999999999999,17,89.914999999999992]
["34TTJT","LH Jaw and Body TT 3/4\"Jaw 3/4\"Pin      ",235.12,17,164.584]
[null,null,null,null,""]
["Rigging Turnbuckles - Left Hand Eye Toggle and Body Only (Tubular Turnbuckle ETT Series)",null,null,null,""]
["10ETTJT","LH Eye Toggle and Body TT 1/4\"Jaw 3/16\"Pin     ",19.399999999999999,17,13.579999999999998]
["14ETTJT","LH Eye Toggle and Body TT 1/4\"Jaw 1/4\"Pin      ",30.9,17,21.63]
["516ETTJT","LH Eye Toggle and Body TT 5/16\"Jaw 5/16\"Pin    ",38.75,17,27.125]
["38ETTJT","LH Eye Toggle and Body TT 3/8\"Jaw 3/8\"Pin      ",51.48,17,36.035999999999994]
["12ETTJT","LH Eye Toggle and Body TT 1/2\"Jaw 1/2\"Pin      ",101.49,17,71.042999999999992]
["58ETTJT","LH Eye Toggle and Body TT 5/8\"Jaw 5/8\"Pin      ",160.58000000000001,17,112.40600000000001]
["34ETTJT","LH Eye Toggle and Body TT 3/4\"Jaw 3/4\"Pin      ",252.32,17,176.624]
["78ETTJT","LH Eye Toggle and Body TT 7/8\"Jaw 7/8\"Pin      ",630.80999999999995,17,441.56699999999995]
[null,null,null,null,""]
["Rigging Studs (Machine Swage) - Imperial Wire Sizes",null,null,null,""]
["10SE116RH","Stud Rigging 1/16\" Wire 10-32 X 1-3/4 RH ",8.49,18,5.9429999999999996]
["10SE116LH","Stud Rigging 1/16\" Wire 10-32 X 1-3/4 LH ",8.49,18,5.9429999999999996]
["10ASE116RH","Stud Rigging 1/16\" Wire 10-32 X 3 RH     ",11.3,18,7.91]
["10SE332RH","Stud Rigging 3/32\" Wire 10-32 X 1-3/4 RH ",8.49,18,5.9429999999999996]
["10SE332LH","Stud Rigging 3/32\" Wire 10-32 X 1-3/4 LH ",8.49,18,5.9429999999999996]
["10ASE332RH","Stud Rigging 3/32\" Wire 10-32 X 3 RH     ",10.8,18,7.56]
["14SE332RH","Stud Rigging 3/32\" Wire 1/4-28 X 2-1/4 RH",8.6199999999999992,18,6.0339999999999989]
["14SE332LH","Stud Rigging 3/32\" Wire 1/4-28 X 2-1/4 LH",8.6199999999999992,18,6.0339999999999989]
["10SE18RH","Stud Rigging 1/8\" Wire 10-32 X 1-3/4 RH ",10.85,18,7.5949999999999989]
["10SE18LH","Stud Rigging 1/8\" Wire 10-32 X 1-3/4 LH ",10.85,18,7.5949999999999989]
["10ASE18RH","Stud Rigging 1/8\" Wire 10-32 X 3 RH      ",11.29,18,7.9029999999999987]
["14SE18RH","Stud Rigging 1/8\" Wire 1/4-28 X 2 1/4 RH ",8.64,18,{"$f":"IF(ISBLANK(C521),\"\",C521*$E$5)","v":6.048}]
["14SE18LH","Stud Rigging 1/8\" Wire 1/4-28 X 2 1/4 LH ",8.64,18,6.048]
["14ASE18RH","Stud Rigging 1/8\" Wire 1/4-28 X 3-1/2 RH ",10.97,18,7.6790000000000003]
["14SE532RH","Stud Rigging 5/32\" Wire 1/4-28 X 2 1/4 RH",11.58,18,8.1059999999999999]
["14SE532LH","Stud Rigging 5/32\" Wire 1/4-28 X 2 1/4 LH",11.58,18,8.1059999999999999]
["14ASE532RH","Stud Rigging 5/32\" Wire 1/4-28 X 3-1/2 RH",12.69,18,8.8829999999999991]
["516SE532RH","Stud Rigging 5/32\" Wire 5/16-24 X 2 1/2RH",11.74,18,8.218]
["516SE532LH","Stud Rigging 5/32\" Wire 5/16-24 X 2 5/8LH",11.74,18,8.218]
["516SE316RH","Stud Rigging 3/16\" Wire 5/16-24 X 2 1/2RH",13.21,18,9.2469999999999999]
["516SE316LH","Stud Rigging 3/16\" Wire 5/16-24 X 2 1/2LH",13.21,18,9.2469999999999999]
["38SE316RH","Stud Rigging 3/16\" Wire 3/8-24 X 2 7/8 RH",12.74,18,8.9179999999999993]
["38SE316LH","Stud Rigging 3/16\" Wire 3/8-24 X 2 7/8 LH",12.74,18,8.9179999999999993]
["38SE732RH","Stud Rigging 7/32\" Wire 3/8-24 X 2 7/8 RH",18.920000000000002,18,13.244]
["38SE732LH","Stud Rigging 7/32\" Wire 3/8-24 X 2 7/8 LH",18.920000000000002,18,13.244]
["716SE732RH","Stud Rigging 7/32\" Wire 7/16-20 X 2 7/8RH",19.2,18,13.44]
["716SE732LH","Stud Rigging 7/32\" Wire 7/16-20 X 2 7/8LH",19.2,18,13.44]
["38SE14RH","Stud Rigging 1/4\" Wire 3/8-24 X 2 7/8 RH ",19.440000000000001,18,13.608000000000001]
["38SE14LH","Stud Rigging 1/4\" Wire 3/8-24 X 2 7/8 LH ",19.440000000000001,18,13.608000000000001]
["716SE14RH","Stud Rigging 1/4\" Wire 7/16-20 X 3 1/4 RH",20.49,18,14.342999999999998]
["716SE14LH","Stud Rigging 1/4\" Wire 7/16-20 X 3 1/4 LH",20.49,18,14.342999999999998]
["12SE14RH","Stud Rigging 1/4\" Wire 1/2-20 X 3 1/4 RH ",20.49,18,14.342999999999998]
["12SE14LH","Stud Rigging 1/4\" Wire 1/2-20 X 3 1/4 LH ",20.49,18,14.342999999999998]
["716SE932RH","Stud Rigging 9/32\" Wire 7/16-20 X 3 1/4RH",28.11,18,19.677]
["716SE932LH","Stud Rigging 9/32\" Wire 7/16-20 X 3 1/4LH",28.11,18,19.677]
["12SE932RH","Stud Rigging 9/32\" Wire 1/2-20 X 3 1/4 RH",28.11,18,19.677]
["12SE932LH","Stud Rigging 9/32\" Wire 1/2-20 X 3 1/4 LH",28.11,18,19.677]
["12SE516RH","Stud Rigging 5/16\" Wire 1/2-20 X 3 1/4 RH",33.299999999999997,18,23.309999999999995]
["12SE516LH","Stud Rigging 5/16\" Wire 1/2-20 X 3 1/4 LH",33.299999999999997,18,23.309999999999995]
["58SE516RH","Stud Rigging 5/16\" Wire 5/8-18 X 4 RH    ",35.39,18,24.773]
["58SE516LH","Stud Rigging 5/16\" Wire 5/8-18 X 4 LH    ",35.39,18,24.773]
["916SE38RH","Stud Rigging 3/8\" Wire 9/16-18 X 4 RH    ",44.21,18,30.946999999999999]
["916SE38LH","Stud Rigging 3/8\" Wire 9/16-18 X 4 LH    ",44.21,18,30.946999999999999]
["58SE38RH","Stud Rigging 3/8\" Wire 5/8-18 X 4 RH     ",44.21,18,30.946999999999999]
["58SE38LH","Stud Rigging 3/8\" Wire 5/8-18 X 4 LH     ",44.21,18,30.946999999999999]
["34SE716RH","Stud Rigging 7/16\" Wire 3/4-16 X 5 RH    ",67.23,18,47.061]
["34SE716LH","Stud Rigging 7/16\" Wire 3/4-16 X 5 LH    ",67.23,18,47.061]
["34SE12RH","Stud Rigging 1/2\" Wire 3/4-16 X 5 RH",85.63,18,59.940999999999995]
["34SE12LH","Stud Rigging 1/2\" Wire 3/4-16 X 5 LH     ",85.63,18,59.940999999999995]
["78SE12RH","Stud Rigging 1/2\" Wire 7/8-14 X 6 RH     ",141.33000000000001,18,98.930999999999997]
["78SE12LH","Stud Rigging 1/2\" Wire 7/8-14 X 6 LH     ",141.33000000000001,18,98.930999999999997]
["78SE916RH","Stud Rigging 9/16\" Wire 7/8-14 X 6 RH    ",164.29,18,115.00299999999999]
["78SE916LH","Stud Rigging 9/16\" Wire 7/8-14 X 6 LH    ",164.29,18,115.00299999999999]
["1SE916RH","Stud Rigging 9/16\" Wire 1-12 X 6 7/8 RH",196.78,18,137.74599999999998]
["1SE916LH","Stud Rigging 9/16\" Wire 1-12 X 6 7/8 LH",196.78,18,137.74599999999998]
["1SE58RH","Stud Rigging 5/8\" Wire 1-12 X 6 7/8 RH",211.4,18,147.97999999999999]
["1SE58LH","Stud Rigging 5/8\" Wire 1-12 X 6 7/8 LH",211.4,18,147.97999999999999]
[null,null,null,null,""]
["Rigging Studs (Machine Swage) - Metric Wire Sizes",null,null,null,""]
["14SEM03RH","Stud Rigging 3mm Wire 1/4-28 X 2 1/4 RH ",8.64,19,6.048]
["14SEM04RH","Stud Rigging 4mm Wire 1/4-28 X 2 1/4 RH",11.58,19,8.1059999999999999]
["516SEM04RH","Stud Rigging 4mm Wire 5/16-24 X 2 1/2 RH ",13.22,19,9.2539999999999996]
["516SEM05RH","Stud Rigging 5mm Wire 5/16-24 X 2 1/2 RH ",13.21,19,9.2469999999999999]
["38SEM05RH","Stud Rigging 5mm Wire 3/8-24 X 2 7/8 RH  ",12.74,19,8.9179999999999993]
["38SEM06RH","Stud Rigging 6mm Wire 3/8-24 X 2 7/8 RH ",19.440000000000001,19,13.608000000000001]
["716SEM06RH","Stud Rigging 6mm Wire 7/16-20 X 3 1/4 RH",20.49,19,14.342999999999998]
["12SEM06RH","Stud Rigging 6mm Wire 1/2-20 X 3 1/4 RH  ",20.49,19,14.342999999999998]
["716SEM07RH","Stud Rigging 7mm Wire 7/16-20 X 3 1/4RH",28.11,19,19.677]
["12SEM07RH","Stud Rigging 7mm Wire 1/2-20 X 3 1/4 RH",28.11,19,19.677]
["12SEM08RH","Stud Rigging 8mm Wire 1/2-20 X 3 1/4 RH",33.299999999999997,19,23.309999999999995]
["58SEM08RH","Stud Rigging 8mm Wire 5/8-18 X 4 RH    ",35.39,19,24.773]
["916SEM10RH","Stud Rigging 10mm Wire 9/16-18 X 4 RH    ",44.21,19,30.946999999999999]
["58SEM10RH","Stud Rigging 10mm Wire 5/8-18 X 4 RH     ",44.21,19,30.946999999999999]
["34SEM11RH","Stud Rigging 11mm Wire 3/4-16 X 5 RH    ",67.23,19,47.061]
["34SEM12RH","Stud Rigging 12mm Wire 3/4-16 X 5 RH     ",85.63,19,59.940999999999995]
["78SEM12RH","Stud Rigging 12mm Wire 7/8-14 X 6 RH     ",141.33000000000001,19,{"$f":"IF(ISBLANK(C585),\"\",C585*$E$5)","v":98.930999999999997}]
["78SEM14RH","Stud Rigging 14mm Wire 7/8-14 X 6 RH    ",164.29,19,115.00299999999999]
["1SEM14RH","Stud Rigging 14mm Wire 1-12 X 6 7/8 RH",196.78,19,137.74599999999998]
["1SEM16RH","Stud Rigging 16mm Wire 1-12 X 6 7/8\" RH",211.4,19,147.97999999999999]
[null,null,null,null,""]
["Rigging Studs - Extended Turnbuckle Studs (Machine Swage) - Imperial Wire Sizes",null,null,null,""]
["14SE532EX6R","Stud Extended 5/32\"Wire 1/4-28x2 1/4 RH ",21.43,19,15.000999999999999]
["516SE532EX7R","Stud Extended 5/32\" Wire 5/16-24 X 2 1/2",23.18,19,16.225999999999999]
["516SE316EX7R","Stud Extended 3/16\" Wire 5/16-24 X 2 1/2",23.76,19,16.632000000000001]
["38SE316EX8R","Stud Extended 3/16\" Wire 3/8-24 X 2 7/8 ",22.29,19,15.602999999999998]
["38SE732EX8R","Stud Extended 7/32\" Wire 3/8-24 X 2 7/8 ",28.44,19,19.908000000000001]
["38SE14EX8R","Stud Extended 1/4\" Wire 3/8-24 X 2 7/8  ",28.98,19,20.285999999999998]
["12SE14EX12R","Stud Extended 1/4\"Wire 1/2-20 x 3 1/4 RH",30.02,19,21.013999999999999]
["12SE932EX12R","Stud Extended 9/32\" Wire 1/2-20 X 3 1/4 ",37.65,19,26.354999999999997]
["12SE516EX12R","Stud Extended 5/16\" Wire 1/2-20 X 3 1/4 ",42.84,19,29.988]
["58SE516EX12R","Stud Extended 5/16\" Wire 5/8-18 X 4 RH  ",52.35,19,36.644999999999996]
["58SE38EX12R","Stud Extended 3/8\" Wire 5/8-18 X 4 RH   ",53.77,19,37.639000000000003]
[null,null,null,null,""]
["Hi-Mod Compression Fitting - Eye - Imperial Wire Sizes",null,null,null,""]
["14CTE18","Hi-Mod Comp Eye 1/8\" Wire x 1/4\" Pin    ",38.799999999999997,21,27.159999999999997]
["14CTE18-7","Hi-Mod Comp Eye 1/8\" 7-Strand Wire x 1/4\" Pin    ",38.799999999999997,21,27.159999999999997]
["516CTE532","Hi-Mod Comp Eye 5/32\" Wire x 5/16\" Pin  ",46.68,21,32.675999999999995]
["516CTE532-7","Hi-Mod Comp Eye 5/32\" 7-Strand Wire x 5/16\" Pin  ",46.68,21,32.675999999999995]
["38CTE316","Hi-Mod Comp Eye 3/16\" Wire x 3/8\" Pin   ",55.64,21,38.948]
["38CTE316-7","Hi-Mod Comp Eye 3/16\" 7-Strand Wire x 3/8\" Pin   ",55.64,21,38.948]
["38CTE732","Hi-Mod Comp Eye 7/32\" Wire x 3/8\" Pin   ",55.65,21,38.954999999999998]
["38CTE732-7","Hi-Mod Comp Eye 7/32\" 7-Strand Wire x 3/8\" Pin   ",55.65,21,38.954999999999998]
["716CTE732","Hi-Mod Comp Eye 7/32\" Wire x 7/16\" Pin  ",60.01,21,42.006999999999998]
["716CTE732-7","Hi-Mod Comp Eye 7/32\" 7-Strand Wire x 7/16\" Pin  ",60.01,21,42.006999999999998]
["38CTE14","Hi-Mod Comp Eye 1/4\" Wire x 3/8\" Pin    ",66.72,21,46.703999999999994]
["38CTE14-7","Hi-Mod Comp Eye 1/4\" 7-Strand Wire x 3/8\" Pin    ",66.72,21,46.703999999999994]
["716CTE14","Hi-Mod Comp Eye 1/4\" Wire x 7/16\" Pin   ",71.06,21,49.741999999999997]
["716CTE14-7","Hi-Mod Comp Eye 1/4\" 7-Strand Wire x 7/16\" Pin   ",71.06,21,49.741999999999997]
["12CTE14","Hi-Mod Comp Eye 1/4\" Wire x 1/2\" Pin    ",71.97,21,50.378999999999998]
["12CTE14-7","Hi-Mod Comp Eye 1/4\" 7-Strand Wire x 1/2\" Pin    ",71.959999999999994,21,50.371999999999993]
["12CTE932","Hi-Mod Comp Eye 9/32\" Wire x 1/2\" Pin   ",80.98,21,56.686]
["12CTE932-7","Hi-Mod Comp Eye 9/32\" 7-Strand Wire x 1/2\" Pin   ",80.98,21,56.686]
["12CTE516","Hi-Mod Comp Eye 5/16\" Wire x 1/2\" Pin   ",98.29,21,68.802999999999997]
["12CTE516-7","Hi-Mod Comp Eye 5/16\" 7-Strand Wire x 1/2\" Pin   ",98.29,21,68.802999999999997]
["916CTE516","Hi-Mod Comp Eye 5/16\" Wire x 9/16\" Pin  ",102.65,21,71.855000000000004]
["916CTE516-7","Hi-Mod Comp Eye 5/16\" 7-Strand Wire x 9/16\" Pin  ",102.65,21,71.855000000000004]
["58CTE516","Hi-Mod Comp Eye 5/16\" Wire x 5/8\" Pin   ",99.78,21,69.845999999999989]
["58CTE516-7","Hi-Mod Comp Eye 5/16\" 7-Strand Wire x 5/8\" Pin   ",99.78,21,69.845999999999989]
["58CTE38","Hi-Mod Comp Eye 3/8\" Wire x 5/8\" Pin    ",131.9,21,92.33]
["58CTE38-7","Hi-Mod Comp Eye 3/8\" 7-Strand Wire x 5/8\" Pin    ",131.9,21,92.33]
["34CTE716","Hi-Mod Comp Eye 7/16\" Wire x 3/4\" Pin   ",303.94,21,212.75799999999998]
["34CTE716-7","Hi-Mod Comp Eye 7/16\" 7-Strand Wire x 3/4\" Pin   ",303.94,21,212.75799999999998]
["34CTE12","Hi-Mod Comp Eye 1/2\" Wire x 3/4\" Pin    ",303.94,21,212.75799999999998]
["34CTE12-7","Hi-Mod Comp Eye 1/2\" 7-Strand Wire x 3/4\" Pin    ",303.94,21,212.75799999999998,null,null,null,"4.5 rigging pin"]
["78CTE916","Hi-Mod Comp Eye 9/16\" Wire x 7/8\" Pin   ",374.41,21,262.08699999999999]
["78CTE916-7","Hi-Mod Comp Eye 9/16\" 7-Strand Wire x 7/8\" Pin   ",374.41,21,262.08699999999999]
["1CTE58","Hi-Mod Comp Eye 5/8\" Wire x 1\" Pin      ",458.78,21,321.14599999999996]
["1CTE58-7","Hi-Mod Comp Eye 5/8\" 7-Strand Wire x 1\" Pin      ",458.78,21,321.14599999999996]
["118CTE34","Hi-Mod Comp Eye 3/4\" Wire x 1-1/8\" Pin      ",992.69,21,694.88300000000004]
["118CTE34-7","Hi-Mod Comp Eye 3/4\" 7-Strand Wire x 1-1/8\" Pin      ",992.69,21,694.88300000000004]
["114CTE78","Hi-Mod Comp Eye 7/8\" Wire x 1-1/4\" Pin      ",1174.1199999999999,21,821.8839999999999]
["114CTE78-7","Hi-Mod Comp Eye 7/8\" 7-Strand Wire x 1-1/4\" Pin      ",1174.1199999999999,21,821.8839999999999]
["138CTE1","Hi-Mod Comp Eye 1.0\" Wire x 1-3/8\" Pin      ",1604.05,21,1122.8349999999998]
["138CTE1-7","Hi-Mod Comp Eye 1.0\" 7-Strand Wire x 1-3/8\" Pin      ",1604.05,21,1122.8349999999998]
[null,null,null,null,""]
["Hi-Mod Compression Fitting - Eye - Metric Wire Sizes",null,null,null,""]
["14CTEM03","Hi-Mod Comp Eye 3mm Wire x 1/4\" Pin    ",38.799999999999997,21,27.159999999999997]
["14CTEM03-7","Hi-Mod Comp Eye 3mm 7-Strand Wire x 1/4\" Pin    ",38.799999999999997,21,27.159999999999997]
["516CTEM04","Hi-Mod Comp Eye 4mm Wire x 5/16\" Pin    ",46.68,21,32.675999999999995]
["516CTEM04-7","Hi-Mod Comp Eye 4mm 7-Strand Wire x 5/16\" Pin    ",46.68,21,{"$f":"IF(ISBLANK(C649),\"\",C649*$E$5)","v":32.675999999999995}]
["38CTEM05","Hi-Mod Comp Eye 5mm Wire x 3/8\" Pin    ",55.64,21,38.948]
["38CTEM05-7","Hi-Mod Comp Eye 5mm 7-Strand Wire x 3/8\" Pin    ",55.64,21,38.948]
["38CTEM05-D","Hi-Mod Comp Eye 5mm Dyform Wire x 3/8\" Pin    ",55.64,21,38.948]
["38CTEM06","Hi-Mod Comp Eye 6mm Wire x 3/8\" Pin    ",66.72,21,46.703999999999994]
["38CTEM06-7","Hi-Mod Comp Eye 6mm 7-Strand Wire x 3/8\" Pin    ",66.72,21,46.703999999999994]
["38CTEM06-D","Hi-Mod Comp Eye 6mm Dyform Wire x 3/8\" Pin    ",66.72,21,46.703999999999994]
["716CTEM06","Hi-Mod Comp Eye 6mm Wire x 7/16\" Pin    ",71.06,21,49.741999999999997]
["716CTEM06-7","Hi-Mod Comp Eye 6mm 7-Strand Wire x 7/16\" Pin    ",71.06,21,49.741999999999997]
["716CTEM06-D","Hi-Mod Comp Eye 6mm Dyform Wire x 7/16\" Pin    ",71.06,21,49.741999999999997]
["12CTEM06","Hi-Mod Comp Eye 6mm Wire x 1/2\" Pin    ",71.959999999999994,21,50.371999999999993]
["12CTEM06-7","Hi-Mod Comp Eye 6mm 7-Strand Wire x 1/2\" Pin    ",71.959999999999994,21,50.371999999999993]
["12CTEM06-D","Hi-Mod Comp Eye 6mm Dyform Wire x 1/2\" Pin    ",71.959999999999994,21,50.371999999999993]
["12CTEM07","Hi-Mod Comp Eye 7mm Wire x 1/2\" Pin    ",80.98,21,56.686]
["12CTEM07-7","Hi-Mod Comp Eye 7mm 7-Strand Wire x 1/2\" Pin    ",80.98,21,56.686]
["12CTEM07-D","Hi-Mod Comp Eye 7mm Dyform Wire x 1/2\" Pin    ",80.98,21,56.686]
["12CTEM08","Hi-Mod Comp Eye 8mm Wire x 1/2\" Pin    ",98.29,21,68.802999999999997]
["12CTEM08-7","Hi-Mod Comp Eye 8mm 7-Strand Wire x 1/2\" Pin    ",98.29,21,68.802999999999997]
["12CTEM08-D","Hi-Mod Comp Eye 8mm Dyform Wire x 1/2\" Pin    ",98.29,21,68.802999999999997]
["916CTEM08","Hi-Mod Comp Eye 8mm Wire x 9/16\" Pin    ",102.65,21,71.855000000000004]
["916CTEM08-7","Hi-Mod Comp Eye 8mm 7-Strand Wire x 9/16\" Pin    ",102.65,21,71.855000000000004]
["916CTEM08-D","Hi-Mod Comp Eye 8mm Dyform Wire x 9/16\" Pin    ",102.65,21,71.855000000000004]
["58CTEM08","Hi-Mod Comp Eye 8mm Wire x 5/8\" Pin    ",99.78,21,69.845999999999989]
["58CTEM08-7","Hi-Mod Comp Eye 8mm 7-Strand Wire x 5/8\" Pin    ",99.78,21,69.845999999999989]
["58CTEM08-D","Hi-Mod Comp Eye 8mm Dyform Wire x 5/8\" Pin    ",99.78,21,69.845999999999989]
["58CTEM10","Hi-Mod Comp Eye 10mm Wire x 5/8\" Pin    ",131.9,21,92.33]
["58CTEM10-7","Hi-Mod Comp Eye 10mm 7-Strand Wire x 5/8\" Pin    ",131.9,21,92.33]
["58CTEM10-D","Hi-Mod Comp Eye 10mm Dyform Wire x 5/8\" Pin    ",131.9,21,92.33]
["34CTEM12","Hi-Mod Comp Eye 12mm Wire x 3/4\" Pin    ",303.94,21,212.75799999999998]
["34CTEM12-7","Hi-Mod Comp Eye 12mm 7-Strand Wire x 3/4\" Pin    ",303.94,21,212.75799999999998]
["34CTEM12-D","Hi-Mod Comp Eye 12mm Dyform Wire x 3/4\" Pin    ",303.94,21,212.75799999999998]
["78CTEM14","Hi-Mod Comp Eye 14mm Wire x 7/8\" Pin    ",374.41,21,262.08699999999999]
["78CTEM14-D","Hi-Mod Comp Eye 14mm Dyform Wire x 7/8\" Pin    ",374.41,21,262.08699999999999]
["1CTEM16","Hi-Mod Comp Eye 16mm Wire x 1.0\" Pin    ",458.78,21,321.14599999999996]
["1CTEM16-D","Hi-Mod Comp Eye 16mm Dyform Wire x 1.0\" Pin    ",458.78,21,321.14599999999996]
[null,null,"",null,{"$error":"#VALUE!"}]
["Hi-Mod Compression Fitting - Fork - Imperial Wire Sizes",null,"",null,{"$error":"#VALUE!"}]
["14CTF18","Hi-Mod Comp Fork 1/8\" Wire x 1/4\" Pin   ",48.48,22,33.935999999999993]
["14CTF18-7","Hi-Mod Comp Fork 1/8\" 7-Strand Wire x 1/4\" Pin   ",48.48,22,33.935999999999993]
["516CTF532","Hi-Mod Comp Fork 5/32\" Wire x 5/16\" Pin  ",57.17,22,40.018999999999998]
["516CTF532-7","Hi-Mod Comp Fork 5/32\" 7-Strand Wire x 5/16\" Pin  ",57.17,22,40.018999999999998]
["38CTF316","Hi-Mod Comp Fork 3/16\" Wire x 3/8\" Pin  ",69.5,22,48.65]
["38CTF316-7","Hi-Mod Comp Fork 3/16\" 7-Strand Wire x 3/8\" Pin  ",69.5,22,48.65]
["38CTF732","Hi-Mod Comp Fork 7/32\" Wire x 3/8\" Pin  ",69.5,22,48.65]
["38CTF732-7","Hi-Mod Comp Fork 7/32\" 7-Strand Wire x 3/8\" Pin  ",69.5,22,48.65]
["716CTF14","Hi-Mod Comp Fork 1/4\" Wire x 7/16\" Pin  ",91.76,22,64.231999999999999]
["716CTF14-7","Hi-Mod Comp Fork 1/4\" 7-Strand Wire x 7/16\" Pin  ",91.76,22,64.231999999999999]
["12CTF14","Hi-Mod Comp Fork 1/4\" Wire x 1/2\" Pin   ",91.76,22,64.231999999999999]
["12CTF14-7","Hi-Mod Comp Fork 1/4\" 7-Strand Wire x 1/2\" Pin   ",91.76,22,64.231999999999999]
["12CTF932","Hi-Mod Comp Fork 9/32\" Wire x 1/2\" Pin  ",94.05,22,65.834999999999994]
["12CTF932-7","Hi-Mod Comp Fork 9/32\" 7-Strand Wire x 1/2\" Pin  ",94.05,22,65.834999999999994]
["12CTF516","Hi-Mod Comp Fork 5/16\" Wire x 1/2\" Pin  ",111.26,22,77.882000000000005]
["12CTF516-7","Hi-Mod Comp Fork 5/16\" 7-Strand Wire x 1/2\" Pin  ",111.26,22,77.882000000000005]
["916CTF516","Hi-Mod Comp Fork 5/16\" Wire x 9/16\" Pin ",153,22,107.1]
["916CTF516-7","Hi-Mod Comp Fork 5/16\" 7-Strand Wire x 9/16\" Pin ",153,22,107.1]
["58CTF516","Hi-Mod Comp Fork 5/16\" Wire x 5/8\" Pin  ",114.69,22,80.282999999999987]
["58CTF516-7","Hi-Mod Comp Fork 5/16\" 7-Strand Wire x 5/8\" Pin  ",114.69,22,80.282999999999987]
["58CTF38","Hi-Mod Comp Fork 3/8\" Wire x 5/8\" Pin   ",154.84,22,108.38799999999999]
["58CTF38-7","Hi-Mod Comp Fork 3/8\" 7-Strand Wire x 5/8\" Pin   ",154.84,22,108.38799999999999]
["34CTF716","Hi-Mod Comp Fork 7/16\" Wire x 3/4\" Pin  ",366.96,22,256.87199999999996]
["34CTF716-7","Hi-Mod Comp Fork 7/16\" 7-Strand Wire x 3/4\" Pin  ",366.96,22,256.87199999999996]
["34CTF12","Hi-Mod Comp Fork 1/2\" Wire x 3/4\" Pin   ",366.96,22,256.87199999999996]
["34CTF12-7","Hi-Mod Comp Fork 1/2\" 7-Strand Wire x 3/4\" Pin   ",366.96,22,256.87199999999996]
["78CTF916","Hi-Mod Comp Fork 9/16\" Wire x 3/4\" Pin  ",453.03,22,317.12099999999998]
["78CTF916-7","Hi-Mod Comp Fork 9/16\" 7-Strand Wire x 3/4\" Pin  ",453.03,22,{"$f":"IF(ISBLANK(C713),\"\",C713*$E$5)","v":317.12099999999998}]
["1CTF58","Hi-Mod Comp Fork 5/8\" Wire x 1\" Pin     ",676.7,22,473.69]
["1CTF58-7","Hi-Mod Comp Fork 5/8\" 7-Strand Wire x 1\" Pin     ",676.7,22,473.69]
["118CTF34","Hi-Mod Comp Fork 3/4\" Wire x 1-1/8\" Pin     ",1213.08,22,849.15599999999995]
["118CTF34-7","Hi-Mod Comp Fork 3/4\" 7-Strand Wire x 1-1/8\" Pin     ",1213.08,22,849.15599999999995]
["114CTF78","Hi-Mod Comp Fork 7/8\" Wire x 1-1/4\" Pin     ",1578.91,22,1105.2370000000001]
["114CTF78-7","Hi-Mod Comp Fork 7/8\" 7-Strand Wire x 1-1/4\" Pin     ",1578.91,22,1105.2370000000001]
["138CTF1","Hi-Mod Comp Fork 1.0\" Wire x 1-3/8\" Pin     ",1952.03,22,1366.4209999999998]
["138CTF1-7","Hi-Mod Comp Fork 1.0\" 7-Strand Wire x 1-3/8\" Pin     ",1952.03,22,1366.4209999999998]
[null,null,"",null,{"$error":"#VALUE!"}]
["Hi-Mod Compression Fitting - Fork - Metric Wire Sizes",null,"",null,{"$error":"#VALUE!"}]
["14CTFM03","Hi-Mod Comp Fork 3mm Wire x 1/4\" Pin   ",48.48,22,33.935999999999993]
["14CTFM03-7","Hi-Mod Comp Fork 3mm 7-Strand Wire x 1/4\" Pin   ",48.48,22,33.935999999999993]
["516CTFM04","Hi-Mod Comp Fork 4mm Wire x 5/16\" Pin  ",57.17,22,40.018999999999998]
["516CTFM04-7","Hi-Mod Comp Fork 4mm 7-Strand Wire x 5/16\" Pin  ",57.17,22,40.018999999999998]
["38CTFM05","Hi-Mod Comp Fork 5mm Wire x 3/8\" Pin  ",69.5,22,48.65]
["38CTFM05-7","Hi-Mod Comp Fork 5mm 7-Strand Wire x 3/8\" Pin  ",69.5,22,48.65]
["38CTFM05-D","Hi-Mod Comp Fork 5mm Dyform Wire x 3/8\" Pin  ",69.5,22,48.65]
["716CTFM06","Hi-Mod Comp Fork 6mm Wire x 7/16\" Pin  ",91.76,22,64.231999999999999]
["716CTFM06-7","Hi-Mod Comp Fork 6mm 7-Strand Wire x 7/16\" Pin  ",91.76,22,64.231999999999999]
["716CTFM06-D","Hi-Mod Comp Fork 6mm Dyform Wire x 7/16\" Pin  ",91.76,22,64.231999999999999]
["12CTFM07","Hi-Mod Comp Fork 7mm Wire x 1/2\" Pin  ",94.05,22,65.834999999999994]
["12CTFM07-7","Hi-Mod Comp Fork 7mm 7-Strand Wire x 1/2\" Pin  ",94.05,22,65.834999999999994]
["12CTFM07-D","Hi-Mod Comp Fork 7mm Dyform Wire x 1/2\" Pin  ",94.05,22,65.834999999999994]
["12CTFM08","Hi-Mod Comp Fork 8mm Wire x 1/2\" Pin  ",111.26,22,77.882000000000005]
["12CTFM08-7","Hi-Mod Comp Fork 8mm 7-Strand Wire x 1/2\" Pin  ",111.26,22,77.882000000000005]
["12CTFM08-D","Hi-Mod Comp Fork 8mm Dyform Wire x 1/2\" Pin  ",111.26,22,77.882000000000005]
["916CTFM08","Hi-Mod Comp Fork 8mm Wire x 9/16\" Pin  ",153,22,107.1]
["916CTFM08-7","Hi-Mod Comp Fork 8mm 7-Strand Wire x 9/16\" Pin  ",153,22,107.1]
["916CTFM08-D","Hi-Mod Comp Fork 8mm Dyform Wire x 9/16\" Pin  ",153,22,107.1]
["58CTFM08","Hi-Mod Comp Fork 8mm Wire x 5/8\" Pin  ",114.69,22,80.282999999999987]
["58CTFM08-7","Hi-Mod Comp Fork 8mm 7-Strand Wire x 5/8\" Pin  ",114.69,22,80.282999999999987]
["58CTFM08-D","Hi-Mod Comp Fork 8mm Dyform Wire x 5/8\" Pin  ",114.69,22,80.282999999999987]
["58CTFM10","Hi-Mod Comp Fork 10mm Wire x 5/8\" Pin  ",154.84,22,108.38799999999999]
["58CTFM10-7","Hi-Mod Comp Fork 10mm 7-Strand Wire x 5/8\" Pin  ",154.84,22,108.38799999999999]
["58CTFM10-D","Hi-Mod Comp Fork 10mm Dyform Wire x 5/8\" Pin  ",154.84,22,108.38799999999999]
["34CTFM12","Hi-Mod Comp Fork 12mm Wire x 3/4\" Pin  ",366.96,22,256.87199999999996]
["34CTFM12-7","Hi-Mod Comp Fork 12mm 7-Strand Wire x 3/4\" Pin  ",366.96,22,256.87199999999996]
["34CTFM12-D","Hi-Mod Comp Fork 12mm Dyform Wire x 3/4\" Pin  ",366.96,22,256.87199999999996]
["78CTFM14","Hi-Mod Comp Fork 14mm Wire x 7/8\" Pin  ",453.03,22,317.12099999999998]
["78CTFM14-D","Hi-Mod Comp Fork 14mm Dyform Wire x 7/8\" Pin  ",453.03,22,317.12099999999998]
["1CTFM16","Hi-Mod Comp Fork 16mm Wire x 1.0\" Pin  ",676.7,22,473.69]
["1CTFM16-D","Hi-Mod Comp Fork 16mm Dyform Wire x 1.0\" Pin  ",676.7,22,473.69]
[null,null,"",null,{"$error":"#VALUE!"}]
["Hi-Mod Compression Fitting - Toggle - Imperial Wire Sizes",null,"",null,{"$error":"#VALUE!"}]
["14CTT18","Hi-Mod Comp Toggle 1/8\" Wire x 1/4\" Pin  ",48.45,23,33.914999999999999]
["14CTT18-7","Hi-Mod Comp Toggle 1/8\" 7-Strand Wire x 1/4\" Pin  ",48.45,23,33.914999999999999]
["516CTT532","Hi-Mod Comp Toggle 5/32\"Wire x 5/16\" Pin",59.31,23,41.516999999999996]
["516CTT532-7","Hi-Mod Comp Toggle 5/32\" 7-Strand Wire x 5/16\" Pin",59.31,23,41.516999999999996]
["38CTT316","Hi-Mod Comp Toggle 3/16\" Wire x 3/8\" Pin",72.239999999999995,23,50.567999999999991]
["38CTT316-7","Hi-Mod Comp Toggle 3/16\" 7-Strand Wire x 3/8\" Pin",72.239999999999995,23,50.567999999999991]
["38CTT732","Hi-Mod Comp Toggle 7/32\" Wire x 3/8\" Pin",72.239999999999995,23,50.567999999999991]
["38CTT732-7","Hi-Mod Comp Toggle 7/32\" 7-Strand Wire x 3/8\" Pin",72.239999999999995,23,50.567999999999991]
["38CTT14","Hi-Mod Comp Toggle 1/4\" Wire x 3/8\" Pin ",83.3,23,58.309999999999995]
["38CTT14-7","Hi-Mod Comp Toggle 1/4\" 7-Strand Wire x 3/8\" Pin ",83.3,23,58.309999999999995]
["12CTT14","Hi-Mod Comp Toggle 1/4\" Wire x 1/2\" Pin ",96.23,23,67.361000000000004]
["12CTT14-7","Hi-Mod Comp Toggle 1/4\" 7-Strand Wire x 1/2\" Pin ",96.23,23,67.361000000000004]
["12CTT932","Hi-Mod Comp Toggle 9/32\" Wire x 1/2\" Pin",105.25,23,73.674999999999997]
["12CTT932-7","Hi-Mod Comp Toggle 9/32\" 7-Strand Wire x 1/2\" Pin",105.25,23,73.674999999999997]
["12CTT516","Hi-Mod Comp Toggle 5/16\" Wire x 1/2\" Pin",122.56,23,85.792000000000002]
["12CTT516-7","Hi-Mod Comp Toggle 5/16\" 7-Strand Wire x 1/2\" Pin",122.56,23,85.792000000000002]
["916CTT516","Hi-Mod Comp Toggle 5/16\" Wire x 9/16\"Pin",144.81,23,101.36699999999999]
["916CTT516-7","Hi-Mod Comp Toggle 5/16\" 7-Strand Wire x 9/16\"Pin",144.81,23,101.36699999999999]
["58CTT516","Hi-Mod Comp Toggle 5/16\" Wire x 5/8\" Pin",164.17,23,114.91899999999998]
["58CTT516-7","Hi-Mod Comp Toggle 5/16\" 7-Strand Wire x 5/8\" Pin",164.17,23,{"$f":"IF(ISBLANK(C777),\"\",C777*$E$5)","v":114.91899999999998}]
["58CTT38","Hi-Mod Comp Toggle 3/8\" Wire x 5/8\" Pin ",194.11,23,135.87700000000001]
["58CTT38-7","Hi-Mod Comp Toggle 3/8\" 7-Strand Wire x 5/8\" Pin ",194.11,23,135.87700000000001]
["34CTT716","Hi-Mod Comp Toggle 7/16\" Wire x 3/4\" Pin",372.76,23,260.93199999999996]
["34CTT716-7","Hi-Mod Comp Toggle 7/16\" 7-Strand Wire x 3/4\" Pin",372.76,23,260.93199999999996]
["34CTT12","Hi-Mod Comp Toggle 1/2\" Wire x 3/4\" Pin ",372.76,23,260.93199999999996]
["34CTT12-7","Hi-Mod Comp Toggle 1/2\" 7-Strand Wire x 3/4\" Pin ",372.76,23,260.93199999999996]
["78CTT916","Hi-Mod Comp Toggle 9/16\" Wire x 7/8\" Pin",482.16,23,337.512]
["78CTT916-7","Hi-Mod Comp Toggle 9/16\" 7-Strand Wire x 7/8\" Pin",482.16,23,337.512]
["1CTT58","Hi-Mod Comp Toggle, 5/8\" Wire x 1\" Pin  ",632.55999999999995,23,442.79199999999992]
["1CTT58-7","Hi-Mod Comp Toggle, 5/8\" 7-Strand Wire x 1\" Pin  ",632.55999999999995,23,442.79199999999992]
[null,null,"",null,{"$error":"#VALUE!"}]
["Hi-Mod Compression Fitting - Toggle - Metric Wire Sizes",null,"",null,{"$error":"#VALUE!"}]
["14CTTM03","Hi-Mod Comp Toggle 3mm Wire x 1/4\" Pin  ",48.45,23,33.914999999999999]
["14CTTM03-7","Hi-Mod Comp Toggle 3mm 7-Strand Wire x 1/4\" Pin  ",48.45,23,33.914999999999999]
["516CTTM04","Hi-Mod Comp Toggle 4mm Wire x 5/16\" Pin  ",59.31,23,41.516999999999996]
["516CTTM04-7","Hi-Mod Comp Toggle 4mm 7-Strand Wire x 5/16\" Pin  ",59.31,23,41.516999999999996]
["38CTTM05","Hi-Mod Comp Toggle 5mm Wire x 3/8\" Pin  ",72.239999999999995,23,50.567999999999991]
["38CTTM05-7","Hi-Mod Comp Toggle 5mm 7-Strand Wire x 3/8\" Pin  ",72.239999999999995,23,50.567999999999991]
["38CTTM05-D","Hi-Mod Comp Toggle 5mm Dyform Wire x 3/8\" Pin  ",72.239999999999995,23,50.567999999999991]
["38CTTM06","Hi-Mod Comp Toggle 6mm Wire x 3/8\" Pin  ",83.3,23,58.309999999999995]
["38CTTM06-7","Hi-Mod Comp Toggle 6mm 7-Strand Wire x 3/8\" Pin  ",83.3,23,58.309999999999995]
["38CTTM06-D","Hi-Mod Comp Toggle 6mm Dyform Wire x 3/8\" Pin  ",83.3,23,58.309999999999995]
["12CTTM06","Hi-Mod Comp Toggle 6mm Wire x 1/2\" Pin  ",96.23,23,67.361000000000004]
["12CTTM06-7","Hi-Mod Comp Toggle 6mm 7-Strand Wire x 1/2\" Pin  ",96.23,23,67.361000000000004]
["12CTTM06-D","Hi-Mod Comp Toggle 6mm Dyform Wire x 1/2\" Pin  ",96.23,23,67.361000000000004]
["12CTTM07","Hi-Mod Comp Toggle 7mm Wire x 1/2\" Pin  ",105.25,23,73.674999999999997]
["12CTTM07-7","Hi-Mod Comp Toggle 7mm 7-Strand Wire x 1/2\" Pin  ",105.25,23,73.674999999999997]
["12CTTM07-D","Hi-Mod Comp Toggle 7mm Dyformd Wire x 1/2\" Pin  ",105.25,23,73.674999999999997]
["12CTTM08","Hi-Mod Comp Toggle 8mm Wire x 1/2\" Pin  ",122.56,23,85.792000000000002]
["12CTTM08-7","Hi-Mod Comp Toggle 8mm 7-Strand Wire x 1/2\" Pin  ",122.56,23,85.792000000000002]
["12CTTM08-D","Hi-Mod Comp Toggle 8mm Dyform Wire x 1/2\" Pin  ",122.56,23,85.792000000000002]
["916CTTM08","Hi-Mod Comp Toggle 8mm Wire x 9/16\" Pin  ",144.81,23,101.36699999999999]
["916CTTM08-7","Hi-Mod Comp Toggle 8mm 7-Strand Wire x 9/16\" Pin  ",144.81,23,101.36699999999999]
["916CTTM08-D","Hi-Mod Comp Toggle 8mm Dyform Wire x 9/16\" Pin  ",144.81,23,101.36699999999999]
["58CTTM08","Hi-Mod Comp Toggle 8mm Wire x 5/8\" Pin  ",164.17,23,114.91899999999998]
["58CTTM08-7","Hi-Mod Comp Toggle 8mm 7-Strand Wire x 5/8\" Pin  ",164.17,23,114.91899999999998]
["58CTTM08-D","Hi-Mod Comp Toggle 8mm Dyform Wire x 5/8\" Pin  ",164.17,23,114.91899999999998]
["58CTTM10","Hi-Mod Comp Toggle 10mm Wire x 5/8\" Pin  ",194.11,23,135.87700000000001]
["58CTTM10-7","Hi-Mod Comp Toggle 10mm 7-Strand Wire x 5/8\" Pin  ",194.11,23,135.87700000000001]
["58CTTM10-D","Hi-Mod Comp Toggle 10mm Dyform Wire x 5/8\" Pin  ",194.11,23,135.87700000000001]
["34CTTM12","Hi-Mod Comp Toggle 12mm Wire x 3/4\" Pin  ",372.76,23,260.93199999999996]
["34CTTM12-7","Hi-Mod Comp Toggle 12mm 7-Strand Wire x 3/4\" Pin  ",372.76,23,260.93199999999996]
["34CTTM12-D","Hi-Mod Comp Toggle 12mm Dyform Wire x 3/4\" Pin  ",372.76,23,260.93199999999996]
["78CTTM14","Hi-Mod Comp Toggle 14mm Wire x 7/8\" Pin  ",482.16,23,337.512]
["78CTTM14-D","Hi-Mod Comp Toggle 14mm Dyform Wire x 7/8\" Pin  ",482.16,23,337.512]
["1CTTM16","Hi-Mod Comp Toggle 16mm Wire x 1.0\" Pin  ",632.55999999999995,23,442.79199999999992]
["1CTTM16-D","Hi-Mod Comp Toggle 16mm Dyform Wire x 1.0\" Pin  ",632.55999999999995,23,442.79199999999992]
[null,null,"",null,{"$error":"#VALUE!"}]
["Hi-Mod Compression Fitting - Stud - Imperial Wire Sizes",null,"",null,{"$error":"#VALUE!"}]
["14CTS18","Hi-Mod Comp Stud 1/8\" Wire x 1/4-28 Thd ",40.549999999999997,24,28.384999999999994]
["14CTS18-7","Hi-Mod Comp Stud 1/8\" 7-Strand Wire x 1/4-28 Thd ",40.549999999999997,24,28.384999999999994]
["14CTS532","Hi-Mod Comp Stud 5/32\" Wire x 1/4-28 Thd",46.77,24,32.738999999999997]
["14CTS532-7","Hi-Mod Comp Stud 5/32\" 7-Strand Wire x 1/4-28 Thd",46.77,24,32.738999999999997]
["516CTS532","Hi-Mod Comp Stud 5/32\" Wire x 5/16-24 Thd",46.77,24,32.738999999999997]
["516CTS532-7","Hi-Mod Comp Stud 5/32\" 7-Strand Wire x 5/16-24 Thd",46.77,24,32.738999999999997]
["516CTS316","Hi-Mod Comp Stud 3/16\" Wire x 5/16-24 Thd",50.46,24,35.321999999999996]
["516CTS316-7","Hi-Mod Comp Stud 3/16\" 7-Strand Wire x 5/16-24 Thd",50.46,24,35.321999999999996]
["38CTS316","Hi-Mod Comp Stud 3/16\" Wire x 3/8-24 Thd ",50.46,24,35.321999999999996]
["38CTS316-7","Hi-Mod Comp Stud 3/16\" 7-Strand Wire x 3/8-24 Thd ",50.46,24,35.321999999999996]
["38CTS732","Hi-Mod Comp Stud 7/32\" Wire x 3/8-24 Thd",50.46,24,35.321999999999996]
["38CTS732-7","Hi-Mod Comp Stud 7/32\" 7-Strand Wire x 3/8-24 Thd",50.46,24,35.321999999999996]
["716CTS732","Hi-Mod Comp Stud 7/32\" Wire x 7/16-20 Thd",60.22,24,42.153999999999996]
["716CTS732-7","Hi-Mod Comp Stud 7/32\" 7-Strand Wire x 7/16-20 Thd",60.22,24,42.153999999999996]
["38CTS14","Hi-Mod Comp Stud 1/4\" Wire x 3/8-24 Thd ",60.22,24,{"$f":"IF(ISBLANK(C841),\"\",C841*$E$5)","v":42.153999999999996}]
["38CTS14-7","Hi-Mod Comp Stud 1/4\" 7-Strand Wire x 3/8-24 Thd ",60.22,24,42.153999999999996]
["716CTS14","Hi-Mod Comp Stud 1/4\" Wire x 7/16-20 Thd",60.22,24,42.153999999999996]
["716CTS14-7","Hi-Mod Comp Stud 1/4\" 7-Strand Wire x 7/16-20 Thd",60.22,24,42.153999999999996]
["12CTS14","Hi-Mod Comp Stud 1/4\" Wire x 1/2-20 Thd ",60.22,24,42.153999999999996]
["12CTS14-7","Hi-Mod Comp Stud 1/4\" 7-Strand Wire x 1/2-20 Thd ",60.22,24,42.153999999999996]
["12CTS932","Hi-Mod Comp Stud 9/32\" Wire x 1/2-20 Thd",71.099999999999994,24,49.769999999999996]
["12CTS932-7","Hi-Mod Comp Stud 9/32\" 7-Strand Wire x 1/2-20 Thd",71.099999999999994,24,49.769999999999996]
["12CTS516","Hi-Mod Comp Stud 5/16\" Wire x 1/2\"-20 Thd",97.64,24,68.347999999999999]
["12CTS516-7","Hi-Mod Comp Stud 5/16\" 7-Strand Wire x 1/2\"-20 Thd",97.64,24,68.347999999999999]
["58CTS516","Hi-Mod Comp Stud 5/16\" Wire x 5/8\"-18 Thd",99.86,24,69.902000000000001]
["58CTS516-7","Hi-Mod Comp Stud 5/16\" 7-Strand Wire x 5/8\"-18 Thd",99.86,24,69.902000000000001]
["58CTS38","Hi-Mod Comp Stud 3/8\" Wire x 5/8-18 Thd ",132.01,24,92.406999999999982]
["58CTS38-7","Hi-Mod Comp Stud 3/8\" 7-Strand Wire x 5/8-18 Thd ",132.01,24,92.406999999999982]
["34CTS38","Hi-Mod Comp Stud 3/8\" Wire x 3/4-16 Thd ",294.12,24,205.88399999999999]
["34CTS38-7","Hi-Mod Comp Stud 3/8\" 7-Strand Wire x 3/4-16 Thd ",294.12,24,205.88399999999999]
["34CTS716","Hi-Mod Comp Stud 7/16\" Wire x 3/4-16 Thd",294.12,24,205.88399999999999]
["34CTS716-7","Hi-Mod Comp Stud 7/16\" 7-Strand Wire x 3/4-16 Thd",294.12,24,205.88399999999999]
["34CTS12","Hi-Mod Comp Stud 1/2\" Wire x 3/4-16 Thd ",294.12,24,205.88399999999999]
["34CTS12-7","Hi-Mod Comp Stud 1/2\" 7-Strand Wire x 3/4-16 Thd ",294.12,24,205.88399999999999]
["78CTS12","Hi-Mod Comp Stud 1/2\" Wire x 7/8-14 Thd ",309.83999999999997,24,216.88799999999998]
["78CTS12-7","Hi-Mod Comp Stud 1/2\" 7-Strand Wire x 7/8-14 Thd ",309.83999999999997,24,216.88799999999998]
["78CTS916","Hi-Mod Comp Stud 9/16\" Wire x 7/8-14 Thd",378.72,24,265.10399999999998]
["78CTS916-7","Hi-Mod Comp Stud 9/16\" 7-Strand Wire x 7/8-14 Thd",378.72,24,265.10399999999998]
["1CTS58","Hi-Mod Comp Stud 5/8\" Wire x 1.0\"-12 Thd",458.72,24,321.10399999999998]
["1CTS58-7","Hi-Mod Comp Stud 5/8\" 7-Strand Wire x 1.0\"-12 Thd",458.72,24,321.10399999999998]
["118CTS34","Hi-Mod Comp Stud 3/4\" Wire x 1-1/8\"-12 Thd",1171.28,24,819.89599999999996]
["118CTS34-7","Hi-Mod Comp Stud 3/4\" 7-Strand Wire x 1-1/8\"-12 Thd",1171.28,24,819.89599999999996]
["114CTS78","Hi-Mod Comp Stud 7/8\" Wire x 1-1/4\"-12 Thd",1626.6,24,1138.6199999999999]
["114CTS78-7","Hi-Mod Comp Stud 7/8\" 7-Strand Wire x 1-1/4\"-12 Thd",1626.6,24,1138.6199999999999]
["138CTS1","Hi-Mod Comp Stud 1.0\" Wire x 1-3/8\"-12 Thd",2007.94,24,1405.558]
["138CTS1-7","Hi-Mod Comp Stud 1.0\" 7-Strand Wire x 1-3/8\"-12 Thd",2007.94,24,1405.558]
[null,null,"",null,{"$error":"#VALUE!"}]
["Hi-Mod Compression Fitting - Stud - Metric Wire Sizes",null,"",null,{"$error":"#VALUE!"}]
["14CTSM03","Hi-Mod Comp Stud 3mm Wire x 1/4-28 Thd ",40.549999999999997,24,28.384999999999994]
["14CTSM03-7","Hi-Mod Comp Stud 3mm 7-Strand Wire x 1/4-28 Thd ",40.549999999999997,24,28.384999999999994]
["14CTSM04","Hi-Mod Comp Stud 4mm Wire x 1/4-28 Thd ",46.77,24,32.738999999999997]
["14CTSM04-7","Hi-Mod Comp Stud 4mm 7-Strand Wire x 1/4-28 Thd ",46.77,24,32.738999999999997]
["516CTSM04","Hi-Mod Comp Stud 4mm Wire x 5/16-24 Thd ",50.46,24,35.321999999999996]
["516CTSM04-7","Hi-Mod Comp Stud 4mm 7-Strand Wire x 5/16-24 Thd ",50.46,24,35.321999999999996]
["516CTSM05","Hi-Mod Comp Stud 5mm Wire x 5/16-24 Thd ",50.46,24,35.321999999999996]
["516CTSM05-7","Hi-Mod Comp Stud 5mm 7-Strand Wire x 5/16-24 Thd ",50.46,24,35.321999999999996]
["516CTSM05-D","Hi-Mod Comp Stud 5mm Dyform Wire x 5/16-24 Thd ",50.46,24,35.321999999999996]
["38CTSM05","Hi-Mod Comp Stud 5mm Wire x 3/8-24 Thd ",50.46,24,35.321999999999996]
["38CTSM05-7","Hi-Mod Comp Stud 5mm 7-Strand Wire x 3/8-24 Thd ",50.46,24,35.321999999999996]
["38CTSM05-D","Hi-Mod Comp Stud 5mm Dyform Wire x 3/8-24 Thd ",50.46,24,35.321999999999996]
["38CTSM06","Hi-Mod Comp Stud 6mm Wire x 3/8-24 Thd ",60.22,24,42.153999999999996]
["38CTSM06-7","Hi-Mod Comp Stud 6mm 7-Strand Wire x 3/8-24 Thd ",60.22,24,42.153999999999996]
["38CTSM06-D","Hi-Mod Comp Stud 6mm Dyform Wire x 3/8-24 Thd ",60.22,24,42.153999999999996]
["716CTSM06","Hi-Mod Comp Stud 6mm Wire x 7/16-20 Thd ",60.22,24,42.153999999999996]
["716CTSM06-7","Hi-Mod Comp Stud 6mm 7-Strand Wire x 7/16-20 Thd ",60.22,24,42.153999999999996]
["716CTSM06-D","Hi-Mod Comp Stud 6mm Dyform Wire x 7/16-20 Thd ",60.22,24,42.153999999999996]
["12CTSM06","Hi-Mod Comp Stud 6mm Wire x 1/2-20 Thd ",60.22,24,42.153999999999996]
["12CTSM06-7","Hi-Mod Comp Stud 6mm 7-Strand Wire x 1/2-20 Thd ",60.22,24,42.153999999999996]
["12CTSM06-D","Hi-Mod Comp Stud 6mm Dyform Wire x 1/2-20 Thd ",60.22,24,42.153999999999996]
["12CTSM07","Hi-Mod Comp Stud 7mm Wire x 1/2-20 Thd ",71.099999999999994,24,49.769999999999996]
["12CTSM07-7","Hi-Mod Comp Stud 7mm 7-Strand Wire x 1/2-20 Thd ",71.099999999999994,24,49.769999999999996]
["12CTSM07-D","Hi-Mod Comp Stud 7mm Dyform Wire x 1/2-20 Thd ",71.099999999999994,24,49.769999999999996]
["12CTSM08","Hi-Mod Comp Stud 8mm Wire x 1/2-20 Thd ",97.64,24,68.347999999999999]
["12CTSM08-7","Hi-Mod Comp Stud 8mm 7-Strand Wire x 1/2-20 Thd ",97.64,24,68.347999999999999]
["12CTSM08-D","Hi-Mod Comp Stud 8mm Dyform Wire x 1/2-20 Thd ",97.64,24,68.347999999999999]
["58CTSM08","Hi-Mod Comp Stud 8mm Wire x 5/8-18 Thd ",99.86,24,69.902000000000001]
["58CTSM08-7","Hi-Mod Comp Stud 8mm 7-Strand Wire x 5/8-18 Thd ",99.86,24,69.902000000000001]
["58CTSM08-D","Hi-Mod Comp Stud 8mm Dyform Wire x 5/8-18 Thd ",99.86,24,69.902000000000001]
["58CTSM10","Hi-Mod Comp Stud 10mm Wire x 5/8-18 Thd ",132.01,24,{"$f":"IF(ISBLANK(C905),\"\",C905*$E$5)","v":92.406999999999982}]
["58CTSM10-7","Hi-Mod Comp Stud 10mm 7-Strand Wire x 5/8-18 Thd ",132.01,24,92.406999999999982]
["58CTSM10-D","Hi-Mod Comp Stud 10mm Dyform Wire x 5/8-18 Thd ",132.01,24,92.406999999999982]
["34CTSM10","Hi-Mod Comp Stud 10mm Wire x 3/4-16 Thd ",294.12,24,205.88399999999999]
["34CTSM10-7","Hi-Mod Comp Stud 10mm 7-Strand Wire x 3/4-16 Thd ",294.12,24,205.88399999999999]
["34CTSM10-D","Hi-Mod Comp Stud 10mm Dyform Wire x 3/4-16 Thd ",294.12,24,205.88399999999999]
["34CTSM12","Hi-Mod Comp Stud 12mm Wire x 3/4-16 Thd ",294.12,24,205.88399999999999]
["34CTSM12-7","Hi-Mod Comp Stud 12mm 7-Strand Wire x 3/4-16 Thd ",294.12,24,205.88399999999999]
["34CTSM12-D","Hi-Mod Comp Stud 12mm Dyform Wire x 3/4-16 Thd ",294.12,24,205.88399999999999]
["78CTSM14","Hi-Mod Comp Stud 14mm Wire x 7/8-14 Thd ",378.72,24,265.10399999999998]
["78CTSM14-7","Hi-Mod Comp Stud 14mm 7-Strand Wire x 7/8-14 Thd ",378.72,24,265.10399999999998]
["78CTSM14-D","Hi-Mod Comp Stud 14mm Dyform Wire x 7/8-14 Thd ",378.72,24,265.10399999999998]
["1CTSM16","Hi-Mod Comp Stud 16mm Wire x 7/8-14 Thd ",458.72,24,321.10399999999998]
["1CTSM16-7","Hi-Mod Comp Stud 16mm 7-Strand Wire x 7/8-14 Thd ",458.72,24,321.10399999999998]
["1CTSM16-D","Hi-Mod Comp Stud 16mm Dyform Wire x 7/8-14 Thd ",458.72,24,321.10399999999998]
[null,null,null,null,""]
["Hi-Mod Compression Fitting - Extender - Imperial Wire Sizes",null,null,null,""]
["CTX18","Hi-Mod Comp Extender 1/8\" Wire          ",22.32,25,15.623999999999999]
["CTX532","Hi-Mod Comp Extender 5/32\" Wire         ",24.42,25,17.094000000000001]
["CTX316","Hi-Mod Comp Extender 3/16\" Wire         ",28.03,25,19.620999999999999]
["CTX732","Hi-Mod Comp Extender 7/32\" Wire         ",28.03,25,19.620999999999999]
["CTX14","Hi-Mod Comp Extender 1/4\" Wire          ",32.75,25,22.924999999999997]
["CTX932","Hi-Mod Comp Extender 9/32\" Wire         ",39.369999999999997,25,27.558999999999997]
["CTX516","Hi-Mod Comp Extender 5/16\" Wire         ",47.55,25,33.284999999999997]
["CTX38","Hi-Mod Comp Extender 3/8\" Wire          ",66.2,25,46.339999999999996]
["CTX716","Hi-Mod Comp Extender 7/16\" Wire         ",66.2,25,46.339999999999996]
["CTX12","Hi-Mod Comp Extender 1/2\" Wire          ",119.22,25,83.453999999999994]
["CTX916","Hi-Mod Comp Extender 9/16\" Wire         ",160.22,25,112.154]
["CTX58","Hi-Mod Comp Extender 5/8\" Wire          ",227.07,25,158.94899999999998]
[null,null,null,null,""]
["Hi-Mod Compression Fitting - Extender - Metric Wire Sizes",null,null,null,""]
["CTXM03","Hi-Mod Comp Extender 3mm Wire          ",22.32,25,15.623999999999999]
["CTXM04","Hi-Mod Comp Extender 4mm Wire          ",24.42,25,17.094000000000001]
["CTXM05","Hi-Mod Comp Extender 5mm Wire          ",28.03,25,19.620999999999999]
["CTXM06","Hi-Mod Comp Extender 6mm Wire          ",32.75,25,22.924999999999997]
["CTXM07","Hi-Mod Comp Extender 7mm Wire          ",39.369999999999997,25,27.558999999999997]
["CTXM08","Hi-Mod Comp Extender 8mm Wire          ",47.55,25,33.284999999999997]
["CTXM10","Hi-Mod Comp Extender 10mm Wire          ",66.2,25,46.339999999999996]
["CTXM12","Hi-Mod Comp Extender 12mm Wire          ",119.22,25,83.453999999999994]
["CTXM14","Hi-Mod Comp Extender 14mm Wire          ",160.22,25,112.154]
["CTXM16","Hi-Mod Comp Extender 16mm Wire          ",227.07,25,158.94899999999998]
[null,null,null,null,""]
["Hi-Mod Compression Fitting - Splice Link - Imperial Wire Sizes",null,null,null,""]
["CTL18","Hi-Mod Comp Splice Link 1/8\" Wire       ",76.45,25,53.515000000000001]
["CTL532","Hi-Mod Comp Splice Link 5/32\" Wire      ",88.39,25,61.872999999999998]
["CTL316","Hi-Mod Comp Splice Link 3/16\" Wire      ",104.04,25,72.828000000000003]
["CTL732","Hi-Mod Comp Splice Link 7/32\" Wire      ",104.04,25,72.828000000000003]
["CTL14","Hi-Mod Comp Splice Link 1/4\" Wire       ",129.71,25,90.796999999999997]
["CTL932","Hi-Mod Comp Splice Link 9/32\" Wire      ",150.96,25,105.672]
["CTL516","Hi-Mod Comp Splice Link 5/16\" Wire      ",190.99,25,133.69300000000001]
["CTL38","Hi-Mod Comp Splice Link 3/8\" Wire       ",253.76,25,177.63199999999998]
["CTL716","Hi-Mod Comp Splice Link 7/16\" Wire      ",253.76,25,177.63199999999998]
["CTL12","Hi-Mod Comp Splice Link 1/2\" Wire       ",388,25,271.59999999999997]
["CTL916","Hi-Mod Comp Splice Link 9/16\" Wire      ",689.94,25,482.95800000000003]
["CTL58","Hi-Mod Comp Splice Link 5/8\" Wire       ",853.03,25,597.12099999999998]
[null,null,null,null,""]
["Hi-Mod Compression Fitting - Splice Link - Metric Wire Sizes",null,null,null,""]
["CTLM03","Hi-Mod Comp Splice Link 3mm Wire       ",76.45,25,53.515000000000001]
["CTLM04","Hi-Mod Comp Splice Link 4mm Wire       ",88.39,25,61.872999999999998]
["CTLM05","Hi-Mod Comp Splice Link 5mm Wire       ",104.04,25,72.828000000000003]
["CTLM06","Hi-Mod Comp Splice Link 6mm Wire       ",129.71,25,90.796999999999997]
["CTLM07","Hi-Mod Comp Splice Link 7mm Wire       ",150.96,25,105.672]
["CTLM08","Hi-Mod Comp Splice Link 8mm Wire       ",190.99,25,133.69300000000001]
["CTLM10","Hi-Mod Comp Splice Link 10mm Wire       ",253.76,25,177.63199999999998]
["CTLM12","Hi-Mod Comp Splice Link 12mm Wire       ",388,25,{"$f":"IF(ISBLANK(C969),\"\",C969*$E$5)","v":271.59999999999997}]
["CTLM14","Hi-Mod Comp Splice Link 14mm Wire       ",689.94,25,482.95800000000003]
["CTLM16","Hi-Mod Comp Splice Link 16mm Wire       ",853.03,25,597.12099999999998]
[null,null,null,null,""]
["Hi-Mod Failsafe Insulator - Compression to Compression",null,null,null,""]
["CTICC316","Hi-Mod Insulator Comp/Comp 3/16\" Wire   ",319.99,26,223.99299999999999]
["CTICC316-D","Hi-Mod Insulator Comp/Comp 3/16\" Dyform ",319.99,26,223.99299999999999]
["CTICCM05","Hi-Mod Insulator Comp/Comp 5mm Wire ",319.99,26,223.99299999999999]
["CTICC732","Hi-Mod Insulator Comp/Comp 7/32\" Wire   ",319.99,26,223.99299999999999]
["CTICC732-D","Hi-Mod Insulator Comp/Comp 7/32\" Dyform ",319.99,26,223.99299999999999]
["CTICCM6","Hi-Mod Insulator Comp/Comp 6mm Wire     ",345.68,26,241.976]
["CTICCM6-D","Hi-Mod Insulator Comp/Comp 6mm Dyform   ",345.68,26,241.976]
["CTICC14","Hi-Mod Insulator Comp/Comp 1/4\" Wire    ",345.68,26,241.976]
["CTICC14-D","Hi-Mod Insulator Comp/Comp 1/4\" Dyform  ",345.68,26,241.976]
["CTICC932","Hi-Mod Insulator Comp/Comp 9/32\" Wire   ",392.38,26,274.666]
["CTICC932-D","Hi-Mod Insulator Comp/Comp 9/32\" Dyform ",392.38,26,274.666]
["CTICCM7-D","Hi-Mod Insulator Comp/Comp 7mm Dyform   ",392.38,26,274.666]
["CTICC516","Hi-Mod Insulator Comp/Comp 5/16\" Wire   ",441.89,26,309.32299999999998]
["CTICC516-D","Hi-Mod Insulator Comp/Comp 5/16\" Dyform ",441.89,26,309.32299999999998]
["CTICCM8-D","Hi-Mod Insulator Comp/Comp 8mm Dyform   ",441.89,26,309.32299999999998]
["CTICC38","Hi-Mod Insulator Comp/Comp 3/8\" Wire    ",534.53,26,374.17099999999994]
["CTICC38-D","Hi-Mod Insulator Comp/Comp 3/8\" Dyform  ",534.53,26,374.17099999999994]
["CTICCM10","Hi-Mod Insulator Comp/Comp 10mm Wire    ",534.53,26,374.17099999999994]
["CTICCM10-D","Hi-Mod Insulator Comp/Comp 10mm Dyform  ",534.53,26,374.17099999999994]
["CTICC716","Hi-Mod Insulator Comp/Comp 7/16\" Wire   ",709.96,26,496.97199999999998]
["CTICCM12","Hi-Mod Insulator Comp/Comp 12mm Wire    ",709.96,26,496.97199999999998]
["CTICCM12-D","Hi-Mod Insulator Comp/Comp 12mm Dyform  ",709.96,26,496.97199999999998]
["CTICC12","Hi-Mod Insulator Comp/Comp 1/2\" Wire    ",709.96,26,496.97199999999998]
["CTICC12-D","Hi-Mod Insulator Comp/Comp 1/2\" Dyform  ",709.96,26,496.97199999999998]
["CTICC716-D","Hi-Mod Insulator Comp/Comp 7/16\" Dyform ",709.96,26,496.97199999999998]
["CTICC916","Hi-Mod Insulator Comp/Comp 9/16\" Wire    ",1817.98,26,1272.586]
["CTICCM14","Hi-Mod Insulator Comp/Comp 14mm Wire    ",1817.98,26,1272.586]
["CTICCM14-D","Hi-Mod Insulator Comp/Comp 14mm Dyform  ",1817.98,26,1272.586]
[null,null,null,null,""]
["Hi-Mod Failsafe Insulator - Compression to Eye",null,null,null,""]
["CTICE316-38","Hi-Mod Insulator Comp/Eye 3/16\"W 3/8\"Pin",290.58999999999997,26,203.41299999999998]
["CTICE14-12","Hi-Mod Insulator Comp/Eye 1/4\"W 1/2\"Pin ",328.91,26,230.23699999999999]
["CTICE14-38","Hi-Mod Insulator Comp/Eye 1/4\"W 3/8\"Pin ",328.91,26,230.23699999999999]
["CTICE516-12","Hi-Mod Insulator Comp/Eye 5/16\"W 1/2\"Pin",414.9,26,290.42999999999995]
["CTICE38-58","Hi-Mod Insulator Comp/Eye 3/8\"WR 5/8\"Pin",473.65,26,331.55499999999995]
["CTICE516-58","Hi-Mod Insulator Comp/Eye 5/16\"W 5/8\"Pin",473.65,26,331.55499999999995]
[null,null,null,null,""]
["Hi-Mod Failsafe Insulator - Compression to Fork",null,null,null,""]
["CTICF14-38","Hi-Mod Insulator Comp/Fork 1/4\"W 3/8\"Pin  ",434.65,26,304.25499999999994]
["CTICF14-12","Hi-Mod Insulator Comp/Fork 1/4\"W 1/2\"Pin ",396.9,26,277.83]
[null,null,null,null,""]
["Hi-Mod Failsafe Insulator - Fork to Fork",null,null,null,""]
["CTIFF932-12","Hi-Mod InsulatorS Fork/Fork 9/32\"W 1/2\"Pin",368.84,26,258.18799999999999]
["CTIFF516-916","Hi-Mod Insulator Fork/Fork 5/16\"W 9/16\"Pin",418.2,26,292.73999999999995]
["CTIFF38-58","Hi-Mod Insulator Fork/Fork 3/8\"W 5/8\"Pin  ",508.11,26,355.67699999999996]
[null,null,null,null,""]
["Hi-Mod Failsafe Insulator - Swage to Eye",null,null,null,""]
["CTISE516","Hi-Mod Insulator Swg/Eye 5/16\"W 1/2\"Pin ",418.2,26,292.73999999999995]
["CTISE38","Hi-Mod Insulator Swg/Eye 3/8\"WR 5/8\" Eye",508.12,26,355.68399999999997]
[null,null,null,null,""]
["Hi-Mod Failsafe Insulator - Swage to Swage",null,null,null,""]
["CTISS732","Hi-Mod Insulator Swg/Swg 7/32\" Wire     ",288.52999999999997,26,201.97099999999998]
["CTISS732-DEMI","Hi-Mod Insulator Swg/Swg 7/32\" Wire-Demi",288.52999999999997,26,201.97099999999998]
["CTISS14","Hi-Mod Insulator Swg/Swg 1/4\" Wire      ",287.14999999999998,26,201.00499999999997]
["CTISS14-DEMI","Hi-Mod Insulator Swg/Swg 1/4\" Wire-Demi ",287.14999999999998,26,201.00499999999997]
["CTISS932","Hi-Mod Insulator Swg/Swg 9/32\" Wire     ",349.11,26,244.37699999999998]
["CTISS932-DEMI","Hi-Mod Insulator Swg/Swg 9/32\" Wire-Demi",349.11,26,244.37699999999998]
["CTISS516","Hi-Mod Insulator Swg/Swg 5/16\" Wire     ",377.95,26,264.565]
["CTISS516-DEMI","Hi-Mod Insulator Swg/Swg 5/16\" Wire     ",377.95,26,264.565]
["CTISS38","Hi-Mod Insulator Swg/Swg 3/8\" Wire      ",418.2,26,{"$f":"IF(ISBLANK(C1033),\"\",C1033*$E$5)","v":292.73999999999995}]
["CTISS38-DEMI","Hi-Mod Insulator Swg/Swg 3/8\" Wire-Demi ",418.2,26,292.73999999999995]
["CTISS716","Hi-Mod Insulator Swg/Swg 7/16\" Wire     ",509.03,26,356.32099999999997]
["CTISS716-DEMI","Hi-Mod Insulator Swg/Swg 7/16\" Wire     ",509.03,26,356.32099999999997]
["CTISS12","Hi-Mod Insulator Swg/Swg 1/2\" Wire      ",509.03,26,356.32099999999997]
["CTISS12-DEMI","Hi-Mod Insulator Swg/Swg 1/2\" Wire-Demi ",509.03,26,356.32099999999997]
[null,null,null,null,""]
["Hi-Mod Failsafe Insulator - Swage Fitting Pull Adaptors",null,null,null,""]
["RIP716","Hi-Mod Insulator Pull Tool 7/32-1/4 Wire",79.84,26,55.887999999999998]
["RIP12","Hi-Mod Insulator Pull Tool 9/32 Wire    ",81.040000000000006,26,56.728000000000002]
["RIP58","Hi-Mod Insulator Pull Tool 5/16-3/8 Wire",119.89,26,83.923000000000002]
["RIP34","Hi-Mod Insulator Pull Tool 7/16-1/2 Wire",131.44,26,92.007999999999996]
[null,null,null,null,""]
["Hi-Mod Failsafe Insulator - Rod Rigging",null,null,null,""]
["RIRR8-716","Hi-Mod Rod Insulator-8 7/16-20 Thd      ",368.63,27,258.041]
["RIRR8-12","Hi-Mod Rod Insulator-8 1/2-20 Thd       ",370.67,27,259.46899999999999]
["RIRR10-12","Hi-Mod Rod Insulator-10 1/2\" Thd        ",395.17,27,276.61899999999997]
["RIRR10-916","Hi-Mod Rod Insulator-10 9/16-18 Thd     ",446.54,27,312.57799999999997]
["RIRR12-58","Hi-Mod Rod Insulator-12 5/8-24 Thd      ",500.02,27,350.01399999999995]
["RIRR15-58","Hi-Mod Rod Insulator-15 5/8-18 Thd      ",500.33,27,350.23099999999999]
["RIRR17-58","Hi-Mod Rod Insulator-17 5/8-18 Thd      ",546.33000000000004,27,382.43099999999998]
["RIRR15-34","Hi-Mod Rod Insulator-15, 3/4-16 Thd     ",546.33000000000004,27,382.43099999999998]
["RIRR17-34","Hi-Mod Rod Insulator-17 3/4-16 Thd      ",546.33000000000004,27,382.43099999999998]
["RIRR22-34","Hi-Mod Rod Insulator-22 3/4-16 Thd      ",650.27,27,455.18899999999996]
["RIRR26-78","Hi-Mod Rod Insulator-26 7/8-14 Thd      ",1467.42,27,1027.194]
["RIRR30-78","Hi-Mod Rod Insulator-30 7/8-14 Thd      ",1467.42,27,1027.194]
[null,null,null,null,""]
["Hi-Mod Failsafe Compression Fitting - Replacement Cones",null,null,null,""]
["CTC18","Hi-Mod Cone for 1/8\" 1X19 Wire          ",8.3699999999999992,27,5.8589999999999991]
["CTC18-7","Hi-Mod Cone for 1/8\" 7X7/19 Wire        ",8.3699999999999992,27,5.8589999999999991]
["CTC532","Hi-Mod Cone for 5/32\" 1X19 Wire         ",9.64,27,6.7480000000000002]
["CTC532-7","Hi-Mod Cone - 5/32\" Wire 7X7/19 Strand  ",9.64,27,6.7480000000000002]
["CTC316","Hi-Mod Cone for 3/16\" 1X19 Wire         ",11.52,27,8.0640000000000001]
["CTC316-7","Hi-Mod Cone for 3/16\" 7X7/19 Wire       ",11.52,27,8.0640000000000001]
["CTCM5","Hi-Mod Cone for 5mm Dyform Wire         ",11.52,27,8.0640000000000001]
["CTC732","Hi-Mod Cone for 7/32\" 1X19 Wire         ",11.52,27,8.0640000000000001]
["CTC732-7","Hi-Mod Cone for 7/32\" Wire 7X7/19 Strand  ",11.52,27,8.0640000000000001]
["CTCM6","Hi-Mod Cone for 6mm 1X19 or Dyform Wire ",14.51,27,10.157]
["CTCM6-7","Hi-Mod Cone for 6mm 7X7/19 Wire         ",14.51,27,10.157]
["CTC14","Hi-Mod Cone for 1/4\" 1x19 Wire          ",14.51,27,10.157]
["CTC14-7","Hi-Mod Cone for 1/4\" 7X7/19 Wire        ",14.51,27,10.157]
["CTC932","Hi-Mod Cone for 9/32\" 1X19 Wire         ",17.86,27,12.501999999999999]
["CTC932-7","Hi-Mod Cone for 9/32\" Wire 7X7/19 Strand",17.86,27,12.501999999999999]
["CTCM7","Hi-Mod Cone for 7mm Dyform Wire         ",17.86,27,12.501999999999999]
["CTC516","Hi-Mod Cone for 5/16\" 1X19 Wire         ",22.6,27,15.82]
["CTC516-7","Hi-Mod Cone for 5/16\" 7X7/19 Wire       ",22.6,27,15.82]
["CTC38","Hi-Mod Cone for 3/8\" 1X19 Wire          ",29.1,27,20.37]
["CTC38-7","Hi-Mod Cone for 3/8\" 7X7/19 Wire        ",29.1,27,20.37]
["CTCM10","Hi-Mod Cone for 10mm 1X19 or Dyform Wire",29.1,27,20.37]
["CTCM10-7","Hi-Mod Cone for 10mm Wire 7 Strand       ",29.1,27,20.37]
["CTC716","Hi-Mod Cone for 7/16\" 1X19 Wire         ",29.1,27,20.37]
["CTC716-7","Hi-Mod Cone for 7/16\" 7X7/19 Wire       ",29.1,27,20.37]
["CTCM12","Hi-Mod Cone for 12mm 1X19 or Dyform Wire",44.16,27,30.911999999999995]
["CTCM12-7","Hi-Mod Cone for 12mm 7X7/19 Wire        ",44.16,27,30.911999999999995]
["CTC12","Hi-Mod Cone for 1/2\" 1X19 Wire          ",44.16,27,30.911999999999995]
["CTC12-7","Hi-Mod Cone for 1/2\" 7X7/19 Wire        ",44.16,27,30.911999999999995]
["CTC916","Hi-Mod Cone for 9/16\" 1X19 Wire         ",83.14,27,58.197999999999993]
["CTCM14","Hi-Mod Cone for 14mm 1X19 or Dyform Wire",83.14,27,58.197999999999993]
["CTC58","Hi-Mod Cone for 5/8\" 1X19 Wire          ",103.52,27,72.463999999999999]
["CTCM16","Hi-Mod Cone for 16mm 1X19 or Dyform Wire",103.52,27,72.463999999999999]
[null,null,null,null,""]
["Hi-Mod Failsafe Compression Fitting - Replacement Crown Rings",null,null,null,""]
["CTCR18","Hi-Mod Crown Ring for 1/8\" Wires        ",30.26,27,21.181999999999999]
["CTCR532","Hi-Mod Crown Ring for 5/32\" Wires       ",36.409999999999997,27,25.486999999999995]
["CTCR316","Hi-Mod Crown Ring for 3/16\" Wires      ",16.940000000000001,27,{"$f":"IF(ISBLANK(C1097),\"\",C1097*$E$5)","v":11.858000000000001}]
["CTCRM5-D","Hi-Mod Crown Ring for 5mm Dyform Wire   ",16.940000000000001,27,11.858000000000001]
["CTCR732","Hi-Mod Crown Ring for 7/32\" Wires       ",16.940000000000001,27,11.858000000000001]
["CTCRM6-D","Hi-Mod Crown Ring for 6mm Dyform Wire   ",21.24,27,14.867999999999999]
["CTCR14","Hi-Mod Crown Ring for 1/4\"or6mm 1X19 Wire",21.24,27,14.867999999999999]
["CTCR14-7","Hi-Mod Crown Ring for 1/4\"or6mm 7X7/19 Wire",21.24,27,14.867999999999999]
["CTCR932","Hi-Mod Crown Ring for 9/32\" 1X19 Wire   ",26.22,27,18.353999999999999]
["CTCR932-7","Hi-Mod Crown Ring for 9/32\" 7X7/19 Wire ",26.22,27,18.353999999999999]
["CTCRM7-D","Hi-Mod Crown Ring for 7mm Dyform Wire   ",26.22,27,18.353999999999999]
["CTCR516","Hi-Mod Crown Ring for 5/16\" 1X19 Wire   ",33.17,27,23.219000000000001]
["CTCR516-7","Hi-Mod Crown Ring for 5/16\" 7x7/19 Wire ",33.17,27,23.219000000000001]
["CTCR38","Hi-Mod Crown Ring for 3/8\"-7/16\" 1X19 Wire",42.64,27,29.847999999999999]
["CTCR38-7","Hi-Mod Crown Ring for 3/8\" 7X7/19 Wire  ",42.64,27,29.847999999999999]
["CTCRM10-D","Hi-Mod Crown Ring for 10mm Dyform Wire  ",42.64,27,29.847999999999999]
["CTCRM12-D","Hi-Mod Crown Ring for 12mm Dyform Wire  ",64.8,27,45.359999999999992]
["CTCR12","Hi-Mod Crown Ring for 1/2\" or 12mm Wire ",64.8,27,45.359999999999992]
["CTCR12-7","Hi-Mod Crown Ring for 1/2\"or12mm 7X7/19 Wire",64.8,27,45.359999999999992]
["CTCR916","Hi-Mod Crown Ring for 9/16\" 1X19 Wire   ",121.94,27,85.35799999999999]
["CTCRM14-D","Hi-Mod Crown Ring for 14mm Dyform Wire  ",121.94,27,85.35799999999999]
["CTCR58","Hi-Mod Crown Ring for 5/8\" 1X19 Wire    ",151.86000000000001,27,106.30200000000001]
["CTCRM16-D","Hi-Mod Crown Ring for 16mm Dyform Wire  ",151.86000000000001,27,106.30200000000001]
[null,null,null,null,""]
["Rigging Harware - Rigging Adjuster - Long",null,null,null,""]
["10SA332","Rigging Adjuster, Long 3/32\" Wire-3/16\" Pin",26.21,28,18.346999999999998]
["10SA18","Rigging Adjuster, Long 1/8\" Wire-3/16\" Pin ",27.85,28,19.495000000000001]
["14SA18","Rigging Adjuster, Long 1/8\" Wire-1/4\" Pin  ",35.72,28,25.003999999999998]
["14SA532","Rigging Adjuster, Long 5/32\" Wire-1/4\" Pin ",34.64,28,24.247999999999998]
[null,null,null,null,""]
["Rigging Harware - Rigging Adjuster - Short",null,null,null,""]
["14AR332","Rigging Adjuster, Short 3/32\" Wire-1/4\" Pin",32.28,28,22.596]
["14AR18","Rigging Adjuster, Short 1/8\" Wire-1/4\" Pin ",32.049999999999997,28,22.434999999999995]
[null,null,null,null,""]
["Rigging Harware - Shroud Adjuster",null,null,null,""]
["SA316","Shroud Adjuster 3/16\"-Pin                ",15.01,28,10.507]
[null,null,null,null,""]
["Rigging Harware - Stay Extender",null,null,null,""]
["14EX","Stay Extender 1/4\" Pin                  ",14.54,28,10.177999999999999]
["516EX","Stay Extender 5/16\" Pin                 ",22.81,28,15.966999999999999]
["38EX","Stay Extender 3/8\" Pin                  ",30.52,28,21.363999999999997]
["12EX","Stay Extender 1/2\" Pin                  ",38.96,28,27.271999999999998]
[null,null,null,null,""]
["Rigging Hardware - MS Style Aircraft Eyes",null,null,null,""]
["RE2","MS Style Aircraft Eye 1/16\" Wire - 3/16\" Pin  ",6.14,29,4.2979999999999992]
["RE3","MS Style Aircraft Eye 3/32\" Wire 3/16\" Pin    ",6.34,29,4.4379999999999997]
["RE4","MS Style Aircraft Eye 1/8\" Wire - 3/16\" Pin   ",7.95,29,5.5649999999999995]
["RE5","MS Style Aircraft Eye 5/32\" Wire - 1/4\" Pin   ",11.02,29,7.7139999999999995]
["RE6","MS Style Aircraft Eye 3/16\" Wire - 5/16\" Pin  ",16.43,29,11.500999999999999]
["RE7","MS Style Aircraft Eye 7/32\" Wire - 5/16\" Pin  ",27.97,29,19.578999999999997]
["RE8","MS Style Aircraft Eye 1/4\" Wire - 3/8\" Pin    ",29.32,29,20.523999999999997]
["RE9","MS Style Aircraft Eye 9/32\" Wire - 7/16\" Pin  ",92.88,29,65.015999999999991]
["RE10","MS Style Aircraft Eye 5/16\" Wire - 7/16\" Pin  ",87.7,29,61.39]
["RE12","MS Style Aircraft Eye 3/8\" Wire - 1/2\" Pin    ",129.31,29,90.516999999999996]
["RE14","MS Style Aircraft Eye 7/16\" Wire - 9/16\" Pin    ",151.80000000000001,29,106.26]
["RE16","MS Style Aircraft Eye 1/2\" Wire - 5/8\" Pin    ",219.26,29,153.48199999999997]
[null,null,null,null,""]
["Rigging Hardware - MS Style Aircraft Forks",null,null,null,""]
["RF2","MS Style Aircraft Fork 1/16\" Wire - 3/16\" Pin ",13.71,29,9.5969999999999995]
["RF3","MS Style Aircraft Fork 3/32\" Wire - 3/16\" Pin ",10.97,29,7.6790000000000003]
["RF4","MS Style Aircraft Fork 1/8\" Wire - 3/16\" Pin  ",16.87,29,11.808999999999999]
["RF5","MS Style Aircraft Fork 5/32\" Wire - 1/4\" Pin  ",22.07,29,15.449]
["RF6","MS Style Aircraft Fork 3/16\" Wire - 5/16\" Pin ",29.12,29,20.384]
["RF7","MS Style Aircraft Fork 7/32\" Wire - 5/16\" Pin ",48.17,29,33.719000000000001]
["RF8","MS Style Aircraft Fork 1/4\" Wire - 3/8\" Pin   ",53.32,29,37.323999999999998]
["RF9","MS Style Aircraft Fork 9/32\" Wire - 7/16\" Pin ",84.33,29,59.030999999999992]
["RF10","MS Style Aircraft Fork 5/16\" Wire - 7/16\" Pin ",89.96,29,{"$f":"IF(ISBLANK(C1161),\"\",C1161*$E$5)","v":62.971999999999994}]
["RF12","MS Style Aircraft Fork 3/8\" Wire - 1/2\" Pin   ",146.18,29,102.32599999999999]
["RF14","MS Style Aircraft Fork 7/16\" Wire - 9/16\" Pin   ",174.29,29,122.00299999999999]
["RF16","MS Style Aircraft Fork 1/2\" Wire - 5/8\" Pin   ",224.89,29,157.42299999999997]
[null,null,null,null,""]
["Rigging Hardware - Swage Forks - Imperial Wire Sizes",null,null,null,""]
["SF03","Fork, Swage 1/8\" Wire - 1/4\" Pin        ",16.98,29,11.885999999999999]
["SF04","Fork, Swage 5/32\" Wire - 5/16\" Pin      ",22.32,29,15.623999999999999]
["SF05","Fork, Swage 3/16\" Wire - 3/8\" Pin       ",32.78,29,22.945999999999998]
["SF07","Fork, Swage 1/4\" Wire - 7/16\" Pin       ",48.07,29,33.649000000000001]
["SF08","Fork, Swage 9/32\" Wire - 1/2\" Pin       ",65.25,29,45.674999999999997]
["SF09","Fork, Swage 5/16\" Wire - 1/2\" Pin       ",69.599999999999994,29,48.719999999999992]
["SF09A","Fork, Swage 5/16\" Wire - 5/8\" Pin       ",88.91,29,62.236999999999995]
["SF10","Fork, Swage 3/8\" Wire - 5/8\" Pin        ",119.9,29,83.929999999999993]
["SF12","Fork, Swage 1/2\" Wire - 3/4\" Pin        ",215.75,29,151.02499999999998]
["SF14","Fork, Swage 9/16\" Wire - 7/8\" Pin       ",399.85,29,279.89499999999998]
["SF16","Fork, Swage 5/8\" Wire - 1.0\" Pin       ",588.94000000000005,29,412.25800000000004]
[null,null,null,null,""]
["Rigging Hardware - Swage Forks - Metric Wire Sizes",null,null,null,""]
["SFM03","Fork, Swage 3mm Wire - 1/4\" Pin        ",16.98,29,11.885999999999999]
["SFM04","Fork, Swage 4mm Wire - 5/16\" Pin        ",22.32,29,15.623999999999999]
["SFM05","Fork, Swage 5mm Wire - 3/8\" Pin        ",32.78,29,22.945999999999998]
["SFM06","Fork, Swage 6mm Wire - 7/16\" Pin        ",48.07,29,33.649000000000001]
["SFM07","Fork, Swage 7mm Wire - 1/2\" Pin       ",65.25,29,45.674999999999997]
["SFM08","Fork, Swage 8mm Wire - 1/2\" Pin       ",69.599999999999994,29,48.719999999999992]
["SFM08A","Fork, Swage 8mm Wire - 5/8\" Pin       ",88.91,29,62.236999999999995]
["SFM10","Fork, Swage 10mm Wire - 5/8\" Pin        ",119.9,29,83.929999999999993]
["SFM12","Fork, Swage 12mm Wire - 3/4\" Pin        ",215.75,29,151.02499999999998]
["SFM14","Fork, Swage 14mm Wire - 7/8\" Pin       ",399.85,29,279.89499999999998]
["SFM16","Fork, Swage 16mm Wire - 1.0\" Pin       ",588.94000000000005,29,412.25800000000004]
[null,null,null,null,""]
["Rigging Hardware - Marine Eyes - Imperial Wire Sizes",null,null,null,""]
["ME2","Marine Eye 1/16\" Wire - 1/4\" Pin        ",8.43,30,5.9009999999999998]
["ME3","Marine Eye 3/32\" Wire  - 1/4\" Pin       ",9.16,30,6.4119999999999999]
["ME4","Marine Eye 1/8\" Wire - 1/4\" Pin         ",9.16,30,6.4119999999999999]
["ME5","Marine Eye 5/32\" Wire - 5/16\" Pin       ",10.97,30,7.6790000000000003]
["ME6","Marine Eye 3/16\" Wire - 3/8\" Pin        ",12.31,30,8.6169999999999991]
["ME7","Marine Eye 7/32\" Wire - 7/16\" Pin       ",16.87,30,11.808999999999999]
["ME8","Marine Eye 1/4\" Wire - 1/2\" Pin         ",19.97,30,13.978999999999999]
["ME9","Marine Eye 9/32\" Wire - 1/2\" Pin        ",25.52,30,17.863999999999997]
["ME10A","Marine Eye 5/16\" Wire - 1/2\" Pin        ",28.11,30,19.677]
["ME10B","Marine Eye 5/16\" Wire - 9/16\" Pin        ",30.92,30,21.643999999999998]
["ME10","Marine Eye 5/16\" Wire - 5/8\" Pin        ",32.6,30,22.82]
["ME12","Marine Eye 3/8\" Wire - 5/8\" Pin         ",38.229999999999997,30,26.760999999999996]
["ME14","Marine Eye 7/16\" Wire - 3/4\" Pin        ",69.150000000000006,30,48.405000000000001]
["ME16A","Marine Eye 1/2\" Wire - 3/4\" Pin         ",124.81,30,87.36699999999999]
["ME16","Marine Eye 1/2\" Wire - 7/8\" Pin         ",124.81,30,87.36699999999999]
["ME16B","Marine Eye 9/16\" Wire - 7/8\" Pin        ",253,30,177.1]
["ME18","Marine Eye 5/8\" Wire - 1\" Pin           ",303.60000000000002,30,212.52]
["ME20","Marine Eye 3/4\" Wire - 1-1/8\" Pin           ",562.22,30,393.55399999999997]
[null,null,null,null,""]
["Rigging Hardware - Marine Eyes - Metric Wire Sizes",null,null,null,""]
["MEM03","Marine Eye 3mm Wire - 1/4\" Pin",9.16,30,6.4119999999999999]
["MEM04","Marine Eye 4mm Wire - 5/16\" Pin",10.97,30,7.6790000000000003]
["MEM05","Marine Eye 5mm Wire - 3/8\" Pin",12.31,30,8.6169999999999991]
["MEM06","Marine Eye 6mm Wire - 1/2\" Pin",19.97,30,13.978999999999999]
["MEM07","Marine Eye 7mm Wire - 1/2\" Pin",25.52,30,17.863999999999997]
["MEM08A","Marine Eye 8mm Wire - 1/2\" Pin",28.11,30,19.677]
["MEM08","Marine Eye 8mm Wire - 5/8\" Pin",32.6,30,22.82]
["MEM10","Marine Eye 10mm Wire - 5/8\" Pin",38.229999999999997,30,26.760999999999996]
["MEM11","Marine Eye 11mm Wire 3/4\" Pin",69.150000000000006,30,48.405000000000001]
["MEM12","Marine Eye 12mm Wire - 3/4\" Pin",124.81,30,87.36699999999999]
["MEM14","Marine Eye 14mm Wire 7/8\" Pin",253,30,177.1]
["MEM16","Marine Eye 16mm Wire 1\" Pin",303.60000000000002,30,212.52]
[null,null,null,null,{"$f":"IF(ISBLANK(C1225),\"\",C1225*$E$5)","v":""}]
["Rigging Hardware - Marine Eye Toggle Jaws - Imperial Wire Sizes",null,null,null,""]
["14RT18","Rigging Toggle Jaw ME 1/8\" Wire 1/4\"Pin  ",13.99,30,9.7929999999999993]
["516RT532","Rigging Toggle Jaw ME 5/32\" Wire 5/16\"Pin",18.899999999999999,30,13.229999999999999]
["38RT316","Rigging Toggle Jaw ME 3/16\" Wire 3/8\"Pin ",22.93,30,16.050999999999998]
["12RT14","Rigging Toggle Jaw ME 1/4\" Wire 1/2\"Pin  ",39.770000000000003,30,27.839000000000002]
["12RT932","Rigging Toggle Jaw ME 9/32\"Wire 1/2\"Pin ",49.32,30,34.524000000000001]
["12RT516","Rigging Toggle Jaw ME 5/16\"Wire 1/2\"Pin ",53.91,30,37.736999999999995]
["58RT516","Rigging Toggle Jaw ME 5/16\"Wire 5/8\"Pin ",69.849999999999994,30,48.894999999999996]
["58RT38","Rigging Toggle Jaw ME 3/8\"Wire 5/8\"Pin  ",87.16,30,61.011999999999993]
["34RT716","Rigging Toggle Jaw ME 7/16\"Wire 3/4\"Pin ",149.1,30,104.36999999999999]
["34RT12","Rigging Toggle Jaw ME 1/2\"Wire 3/4\"Pin     ",271.86,30,190.30199999999999]
["78RT916","Rigging Toggle Jaw ME 9/16\"Wire 7/8\"Pin    ",458.78,30,321.14599999999996]
["1RT58","Rigging Toggle Jaw ME 9/16\"Wire 1.0\"Pin",476.01,30,333.20699999999999]
[null,null,null,null,""]
["Rigging Hardware - Marine Eye Toggle Jaws - Metric Wire Sizes",null,null,null,""]
["14RTM03","Rigging Toggle Jaw ME 3mm Wire 1/4\"Pin  ",13.99,30,9.7929999999999993]
["516RTM04","Rigging Toggle Jaw ME 4mm Wire 5/16\"Pin",18.899999999999999,30,13.229999999999999]
["38RTM05","Rigging Toggle Jaw ME 5mm Wire 3/8\"Pin ",22.93,30,16.050999999999998]
["12RTM06","Rigging Toggle Jaw ME 6mm Wire 1/2\"Pin  ",39.770000000000003,30,27.839000000000002]
["12RTM07","Rigging Toggle Jaw ME 7mm Wire 1/2\"Pin ",49.32,30,34.524000000000001]
["12RTM08","Rigging Toggle Jaw ME 8mm Wire 1/2\"Pin ",53.91,30,37.736999999999995]
["58RTM08","Rigging Toggle Jaw ME 8mm Wire 5/8\"Pin ",69.849999999999994,30,48.894999999999996]
["58RTM10","Rigging Toggle Jaw ME 10mm Wire 5/8\"Pin  ",87.16,30,61.011999999999993]
["34RTM11","Rigging Toggle Jaw ME 11mm Wire 3/4\"Pin     ",149.1,30,104.36999999999999]
["34RTM12","Rigging Toggle Jaw ME 12mm Wire 3/4\"Pin     ",149.1,30,104.36999999999999]
["78RTM14","Rigging Toggle Jaw ME 14mm Wire 7/8\"Pin    ",315.41000000000003,30,220.78700000000001]
["1RTM16","Rigging Toggle Jaw ME 16mm Wire 1.0\"Pin",458.78,30,321.14599999999996]
[null,null,null,null,""]
["Rigging Hardware - Double Jaw Toggles",null,null,null,""]
["14DJT","Toggle, Double-Jaw 1/4\" Pin             ",17.2,31,12.04]
["516DJT","Toggle, Double-Jaw 5/16\" Pin            ",28.67,31,20.068999999999999]
["38DJT","Toggle, Double-Jaw 3/8\" Pin             ",29.82,31,20.873999999999999]
["12DJT","Toggle, Double-Jaw 1/2\" Pin             ",50.6,31,35.42]
["58DJT","Toggle, Double-Jaw 5/8\" Pin             ",90.9,31,63.63]
["34DJT","Toggle, Double-Jaw 3/4\" Pin             ",130.16,31,91.111999999999995]
[null,null,null,null,""]
["Rigging Hardware - Eye-Jaw Toggles",null,null,null,""]
["TOG03","Toggle, Eye-Jaw 1/4\" Pin                ",19.25,31,13.475]
["TOG04","Toggle, Eye-Jaw 5/16\" Pin               ",25.75,31,18.024999999999999]
["TOG05","Toggle, Eye-Jaw 3/8\" Pin                ",33.299999999999997,31,23.309999999999995]
["TOG06","Toggle, Eye-Jaw 7/16\" Pin               ",45.9,31,32.129999999999995]
["TOG07","Toggle, Eye-Jaw 1/2\" Pin                ",63.97,31,44.778999999999996]
["TOG08","Toggle, Eye-Jaw 9/16\" Pin               ",116.49,31,81.542999999999992]
["TOG10","Toggle, Eye-Jaw 5/8\" Pin                ",153.41,31,107.38699999999999]
["TOG12","Toggle, Eye-Jaw 3/4\" Pin                ",364.82,31,255.37399999999997]
[null,null,null,null,""]
["Rigging Hardware - Threaded Forks",null,null,null,""]
["TF14RH","Threaded Fork 1/4\"-28 RH w/Cross Hole   ",17.37,31,12.159000000000001]
["TF14LH","Threaded Fork 1/4\"-28 LH w/Cross Hole   ",17.37,31,12.159000000000001]
["TF516RH","Threaded Fork 5/16\"-24 RH w/Cross Hole  ",22.77,31,15.938999999999998]
["TF516LH","Threaded Fork 5/16-24 LH w/Cross Hole   ",22.77,31,15.938999999999998]
["TF38RH","Threaded Fork 3/8\"-24 RH w/Cross Hole   ",33.659999999999997,31,23.561999999999998]
["TF38LH","Threaded Fork 3/8\"-24 LH w/Cross Hole   ",33.659999999999997,31,23.561999999999998]
["TF12RH","Threaded Fork 1/2\"-20 RH w/Cross Hole ",66.87,31,46.808999999999997]
["TF12LH","Threaded Fork 1/2\"-20 LH w/Cross Hole ",66.87,31,46.808999999999997]
["TF58RH","Threaded Fork 5/8\"-18 RH w/Cross Hole   ",114.09,31,79.863]
["TF58LH","Threaded Fork 5/8\"-18 LH w/Cross Hole   ",114.09,31,79.863]
["TF34RH","Threaded Fork 3/4\"-16 RH w/Cross Hole   ",257.45,31,180.21499999999997]
["TF34LH","Threaded Fork 3/4\"-16 LH w/Cross Hole   ",257.45,31,180.21499999999997]
["TF78RH","Threaded Fork 7/8\"-14 RH w/Cross Hole   ",355.87,31,249.10899999999998]
["TF78LH","Threaded Fork 7/8\"-14 LH w/Cross Hole   ",355.87,31,249.10899999999998]
["TF1RH","Threaded Fork 1.0-12 RH w/Cross Hole   ",528.73,31,370.11099999999999]
["TF1LH","Threaded Fork 1.0-12 LH w/Cross Hole   ",528.73,31,370.11099999999999]
[null,null,null,null,{"$f":"IF(ISBLANK(C1289),\"\",C1289*$E$5)","v":""}]
["Lifeline Hardware Section",null,null,null,""]
[null,null,null,null,""]
["Lifeline - Jaw to (Machine)Swage (Tubular Turnbuckle Series) - Imperial Wire Sizes",null,null,null,""]
["10TTLL18","Jaw to Swage TT 1/8\" Wire 3/16\" Pin     ",27.21,33,19.047000000000001]
["14TTLL18","Jaw to Swage TT 1/8\" Wire 1/4\" Pin      ",30.98,33,21.686]
["14TTLL532","Jaw to Swage TT 5/32\" Wire 1/4\" Pin     ",32.1,33,22.47]
["14TTLL316","Jaw to Swage TT 3/16\" Wire 1/4\" Pin     ",33.32,33,23.323999999999998]
["516TTLL316","Jaw to Swage TT 3/16\" Wire 5/16\" Pin    ",46.78,33,32.746000000000002]
["516TTLL14","Jaw to Swage TT 1/4\" Wire 5/16\" Pin     ",54.46,33,38.122]
["38TTLL14","Jaw to Swage TT 1/4\" Wire 3/8\" Pin      ",66.959999999999994,33,46.871999999999993]
[null,null,null,null,""]
["Lifeline - Jaw to (Machine)Swage (Tubular Turnbuckle Series) - Metric Wire Sizes",null,null,null,""]
["14TTLLM04","Jaw to Swage TT 4mm Wire 1/4\" Pin     ",32.090000000000003,33,22.463000000000001]
["14TTLLM05","Jaw to Swage TT 5mm Wire 1/4\" Pin     ",33.32,33,23.323999999999998]
[null,null,null,null,""]
["Lifeline - Jaw to (Handy Crimp)Swage (Tubular Turnbuckle Series)",null,null,null,""]
["14TTCLL18","Jaw to Swage TT/HC 1/8\" Wire 1/4\" Pin   ",35.26,33,24.681999999999999]
["14TTCLL316","Jaw to Swage TT/HC 3/16\" Wire 1/4\" Pin  ",36.71,33,25.696999999999999]
["516TTCLL316","Jaw to Swage TT/HC 3/16\" Wire 5/16\" Pin ",49.85,33,34.894999999999996]
[null,null,null,null,""]
["Lifeline - (Machine) Swage to (Machine)Swage (Tubular Turnbuckle Series) - Imperial Wire Sizes",null,null,null,""]
["10TTLL18SS","Swage to Swage TT 1/8\" Wire 10-32 Thd   ",26.89,33,18.823]
["14TTLL18SS","Swage to Swage TT 1/8\" Wire 1/4-28 Thd  ",28.09,33,19.663]
["14TTLL532SS","Swage to Swage TT 5/32\" Wire 1/4-28 Thd ",30.26,33,21.181999999999999]
["14TTLL316SS","Swage to Swage TT 3/16\" Wire 1/4-28 Thd ",32.67,33,22.869]
["516TTLL316SS","Swage to Swage TT 3/16\" Wire 5/16-24 Thd",37.51,33,26.256999999999998]
["516TTLL14SS","Swage to Swage TT 1/4\" Wire 5/16-24 Thd ",52.58,33,36.805999999999997]
["38TTLL14SS","Swage to Swage TT 1/4\" Wire 3/8-24 Thd  ",59.78,33,41.845999999999997]
[null,null,null,null,""]
["Lifeline - (Machine) Swage to (Machine)Swage (Tubular Turnbuckle Series) - Metric Wire Sizes",null,null,null,""]
["14TTLLM04SS","Swage to Swage TT 4mm Wire 1/4-28 Thd ",30.26,33,21.181999999999999]
["14TTLLM05SS","Swage to Swage TT 5mm Wire 1/4-28 Thd ",32.68,33,22.875999999999998]
[null,null,null,null,""]
["Lifeline - (Handy Crimp)Swage to (Handy Crimp)Swage (Tubular Turnbuckle Series)",null,null,null,""]
["14TTCLL18SS","Swage to Swage TT/HC 1/8\"Wire 1/4-28 Thd",36.479999999999997,33,25.535999999999998]
["14TTCLL316SS","Swage to Swage TT/HC 3/16\"Wire 1/4-28 Thd",39.32,33,27.523999999999997]
["516TTCLL316SS","Swage to Swage TT/HC 3/16\"Wire 5/16-24 Thd",43.52,33,30.463999999999999]
[null,null,null,null,""]
["Lifeline - Jaw to (Machine)Swage (Forged Bronze TFB Series) - Imperial Wire Sizes",null,null,null,""]
["14TFBLL18","Jaw to Swage TFB 1/8\"Wire 1/4\" Pin      ",37.18,34,26.026]
["14TFBLL532","Jaw to Swage TFB 5/32\"Wire 1/4\" Pin     ",38.29,34,26.802999999999997]
["14TFBLL316","Jaw to Swage TFB 3/16\"Wire 1/4\" Pin     ",39.520000000000003,34,27.664000000000001]
["516TFBLL316","Jaw to Swage TFB 3/16\"Wire 5/16\" Pin    ",55.71,34,38.997]
["516TFBLL14","Jaw to Swage TFB 1/4\"Wire 5/16\" Pin     ",63.4,34,44.379999999999995]
["38TFBLL14","Jaw to Swage TFB 1/4\"Wire 3/8\" Pin      ",74.47,34,52.128999999999998]
[null,null,null,null,""]
["Lifeline - Jaw to (Machine)Swage (Forged Bronze TFB Series) - Metric Wire Sizes",null,null,null,""]
["14TFBLLM04","Jaw to Swage TFB 4mmWire 1/4\" Pin     ",38.28,34,26.795999999999999]
["14TFBLLM05","Jaw to Swage TFB 5mm Wire 1/4\" Pin     ",39.520000000000003,34,27.664000000000001]
["516TFBLLM05","Jaw to Swage TFB 5mm Wire 5/16\" Pin    ",55.71,34,38.997]
[null,null,null,null,""]
["Lifeline - Jaw to (Handy Crimp)Swage (Forged Bronze TFB Series)",null,null,null,""]
["14TFBCLL18","Jaw to Swage TFB/HC 1/8\"Wire 1/4\" Pin   ",41.45,34,29.015000000000001]
["14TFBCLL316","Jaw to Swage TFB/HC 3/16\"Wire 1/4\" Pin  ",42.91,34,30.036999999999995]
["516TFBCLL316","Jaw to Swage TFB/HC 3/16\"Wire 5/16\" Pin ",58.78,34,41.146000000000001]
[null,null,null,null,""]
["Lifeline - (Machine)Swage to (Machine)Swage (Forged Bronze TFB Series) - Imperial Wire Sizes",null,null,null,""]
["14TFBLL18SS","Swage to Swage TFB 1/8\" Wire 1/4-28 Thd",34.85,34,24.395]
["14TFBLL532SS","Swage to Swage TFB 5/32\" Wire 1/4-28 Thd ",37.07,34,25.948999999999998]
["14TFBLL316SS","Swage to Swage TFB 3/16\" Wire 1/4-28 Thd ",39.520000000000003,34,27.664000000000001]
["516TFBLL316SS","Swage to Swage TFB 3/16\" Wire 5/16-24 Thd",47.2,34,33.04]
["516TFBLL14SS","Swage to Swage TFB 1/4\" Wire 5/16-24 Thd ",62.57,34,43.798999999999999]
["38TFBLL14SS","Swage to Swage TFB 1/4\" Wire 3/8-24 Thd  ",68.489999999999995,34,47.942999999999991]
[null,null,null,null,{"$f":"IF(ISBLANK(C1353),\"\",C1353*$E$5)","v":""}]
["Lifeline - (Machine)Swage to (Machine)Swage (Forged Bronze TFB Series) - Metric Wire Sizes",null,null,null,""]
["14TFBLLM04SS","Swage to Swage TFB 4mm Wire 1/4-28 Thd ",61.85,34,43.295000000000002]
["14TFBLLM05SS","Swage to Swage TFB 5mm Wire 1/4-28 Thd ",64.290000000000006,34,45.003]
["516TFBLLM05SS","Swage to Swage TFB 5mm Wire 5/16-24 Thd",90.85,34,63.594999999999992]
[null,null,null,null,""]
["Lifeline - (Handy Crimp)Swage to (Handy Crimp)Swage (Forged Bronze TFB Series)",null,null,null,""]
["14TFBCLL18SS","Swage to Swage TFB/HC 1/8\" Wire 1/4-28 Thd",43.4,34,30.379999999999995]
["14TFBCLL316SS","Swage to Swage TFB/HC 3/16\" Wire 1/4-28TH",46.3,34,32.409999999999997]
["516TFBCLL316SS","Swage to Swage TFB/HC 3/16\" Wire 5/16-24T",53.33,34,37.330999999999996]
[null,null,null,null,""]
["Lifeline - Eye to (Machine)Swage (Tubular Turnbuckle Series) - Imperial Wire Sizes",null,null,null,""]
["14TTLL18E","Eye to Swage TT 1/8\" Wire 1/4-28 Thd    ",31.54,35,22.077999999999999]
["14TTLL532E","Eye to Swage TT 5/32\" Wire 1/4-28 Thd   ",32.67,35,22.869]
["14TTLL316E","Eye to Swage TT 3/16\" Wire 1/4-28 Thd   ",33.880000000000003,35,23.716000000000001]
["516TTLL316E","Eye to Swage TT 3/16\" Wire 5/16-24 Thd  ",39.5,35,27.65]
["516TTLL14E","Eye to Swage TT 1/4\" Wire 5/16-24 Thd   ",47.18,35,33.025999999999996]
["38TTLL14E","Eye to Swage TT 1/4\" Wire 3/8-24 Thd    ",57.79,35,40.452999999999996]
[null,null,null,null,""]
["Lifeline - Eye to (Machine)Swage (Tubular Turnbuckle Series) - Metric Wire Sizes",null,null,null,""]
["14TTLLM04E","Eye to Swage TT 4mm Wire 1/4-28 Thd   ",32.67,35,22.869]
["14TTLLM05E","Eye to Swage TT 5mm Wire 1/4-28 Thd   ",33.880000000000003,35,23.716000000000001]
[null,null,null,null,""]
["Lifeline - Eye to (Handy Crimp)Swage (Tubular Turnbuckle Series)",null,null,null,""]
["14TTCLL18E","Eye to Swage TT/HC 1/8\" Wire 1/4-28 Thd ",35.83,35,25.080999999999996]
["14TTCLL316E","Eye to Swage TT/HC 3/16\" Wire 1/4-28 Thd",37.270000000000003,35,26.089000000000002]
["516TTCLL316E","Eye to Swage TT/HC 3/16\" Wire 5/16-24 Thd",42.57,35,29.798999999999999]
[null,null,null,null,""]
["Lifeline - Eye to (Machine)Swage (Forged Bronze TFB Series) - Imperial Wire Sizes",null,null,null,""]
["14TFBLL18E","Eye to Swage TFB 1/8\"Wire 1/4-28 Thd    ",37.74,35,26.417999999999999]
["14TFBLL532E","Eye to Swage TFB 5/32\"Wire 1/4-28 Thd    ",38.85,35,27.195]
["14TFBLL316E","Eye to Swage TFB 3/16\"Wire 1/4-28 Thd    ",40.08,35,28.055999999999997]
["516TFBLL316E","Eye to Swage TFB 3/16\"Wire 5/16-24 Thd   ",48.43,35,33.900999999999996]
["516TFBLL14E","Eye to Swage TFB 1/4\"Wire 5/16-24 Thd    ",56.12,35,39.283999999999999]
["38TFBLL14E","Eye to Swage TFB 1/4\"Wire 3/8-24 Thd     ",65.3,35,45.709999999999994]
[null,null,null,null,""]
["Lifeline - Eye to (Machine)Swage (Forged Bronze TFB Series) - Metric Wire Sizes",null,null,null,""]
["14TFBLLM04E","Eye to Swage TFB 4mm Wire 1/4-28 Thd    ",38.840000000000003,35,27.188000000000002]
["14TFBLLM05E","Eye to Swage TFB 5mm Wire 1/4-28 Thd    ",40.08,35,28.055999999999997]
["516TFBLLM05E","Eye to Swage TFB 5mm Wire 5/16-24 Thd   ",48.43,35,33.900999999999996]
[null,null,null,null,""]
["Lifeline - Eye to (Handy Crimp)Swage (Forged Bronze TFB Series)",null,null,null,""]
["14TFBCLL18E","Eye to Swage TFB/HC 1/8\"Wire 1/4-28 Thd  ",42.02,35,29.414000000000001]
["14TFBCLL316E","Eye to Swage TFB/HC 3/16\"Wire 1/4-28 Thd ",43.47,35,30.428999999999998]
["516TFBCLL316E","Eye to Swage TFB/HC 3/16\"Wire 5/16-24 Thd",51.5,35,36.049999999999997]
[null,null,null,null,""]
["Lifeline - Jaw to Eye (Tubular Turnbuckle Series)",null,null,null,""]
["14TTLLJE","Jaw to Eye TT 1/4\" Pin x 3/32\"-5/32\" Wire",42.75,36,29.924999999999997]
["516TTLLJE","Jaw to Eye TT 5/16\" Pin x 5/32\"-3/16\" Wire",57.63,36,40.341000000000001]
["38TTLLJE","Jaw to Eye TT 3/8\" Pin x 3/16\"-1/4\" Wire",73.010000000000005,36,51.106999999999999]
[null,null,null,null,""]
["Lifeine - Deck Toggle Jaw (Machine Swage) - Imperial Wire Sizes",null,null,null,""]
["14TJLL18DT","Deck Toggle Jaw 1/8\" Wire 1/4\" Screw    ",16.05,36,11.234999999999999]
["14TJLL532DT","Deck Toggle Jaw 5/32\" Wire 1/4\" Screw   ",17.8,36,12.459999999999999]
["14TJLL316DT","Deck Toggle Jaw 3/16\" Wire 1/4\" Screw   ",17.59,36,12.312999999999999]
["516TJLL14DT","Deck Toggle Jaw 1/4\" Wire 5/16\" Screw   ",24.3,36,17.009999999999998]
["38TJLL14DT","Deck Toggle Jaw 1/4\" Wire 3/8\" Screw    ",29.16,36,20.411999999999999]
[null,null,null,null,""]
["Lifeine - Deck Toggle Jaw (Machine Swage) - Metric Wire Sizes",null,null,null,""]
["14TJLLM04DT","Deck Toggle Jaw 4mm Wire 1/4\" Screw   ",17.8,36,12.459999999999999]
["14TJLLM05DT","Deck Toggle Jaw 5mm Wire 1/4\" Screw   ",17.579999999999998,36,12.305999999999997]
[null,null,null,null,""]
["Linfeline - Deck Toggle Jaw (Handy Crimp)",null,null,null,""]
["14TJCLL18DT","Deck Toggle Jaw/HC 1/8\" Wire 1/4\" Screw ",25.91,36,18.137]
["14TJCLL316DT","Deck Toggle Jaw/HC 3/16\" Wire 1/4\" Screw",29.02,36,{"$f":"IF(ISBLANK(C1417),\"\",C1417*$E$5)","v":20.314}]
[null,null,null,null,""]
["Lifeline - Deck Toggle to (Machine) Swage (Tubular Turnbuckle Series) - Imperial Wire Sizes",null,null,null,""]
["14TTLL18DT","Deck Toggle to Swage 1/8\"Wire 1/4\" Screw ",31.08,37,21.755999999999997]
["14TTLL532DT","Deck Toggle to Swage 5/32\"Wire 1/4\" Screw",32.18,37,22.526]
["14TTLL316DT","Deck Toggle to Swage 3/16\"Wire 1/4\" Screw",33.4,37,23.38]
["516TTLL316DT","Deck Toggle to Swage 3/16\"Wire 5/16\" Screw",47.44,37,33.207999999999998]
["516TTLL14DT","Deck Toggle to Swage 1/4\"Wire 5/16\" Screw",55.13,37,38.591000000000001]
["38TTLL14DT","Deck Toggle to Swage 1/4\"Wire 3/8\" Screw ",67.8,37,47.459999999999994]
[null,null,null,null,""]
["Lifeline - Deck Toggle to (Machine) Swage (Tubular Turnbuckle Series) - Metric Wire Sizes",null,null,null,""]
["14TTLLM04DT","Deck Toggle to Swage 4mm Wire 1/4\" Screw",32.19,37,22.532999999999998]
["14TTLLM05DT","Deck Toggle to Swage 5mm Wire 1/4\" Screw",33.42,37,23.393999999999998]
[null,null,null,null,""]
["Lifeline - Deck Toggle to (Handy Crimp) Swage (Tubular Turnbuckle Series)",null,null,null,""]
["14TTCLL18DT","Deck Toggle to Swage/HC 1/8\"Wire 1/4\" Screw",35.35,37,24.745000000000001]
["14TTCLL316DT","Deck Toggle to Swage/HC 3/16\"Wire 1/4\" Screw",36.799999999999997,37,25.759999999999998]
["516TTCLL316DT","Deck Toggle to Swage/HC 3/16\"Wire 5/16\" Screw",50.51,37,35.356999999999999]
[null,null,null,null,""]
["Lifeline - Deck Toggle to (Machine) Swage (Forged Bronze TFB Series) - Imperial Wire Sizes",null,null,null,""]
["14TFBLL18DT","Deck Toggle-Swage/OB 1/8\"Wire 1/4\" Screw ",37.26,37,26.081999999999997]
["14TFBLL532DT","Deck Toggle-Swage/OB 5/32\"Wire 1/4\" Screw",38.380000000000003,37,26.866]
["14TFBLL316DT","Deck Toggle-Swage/OB 3/16\"Wire 1/4\" Screw",39.6,37,27.72]
["516TFBLL316DT","Deck Toggle-Swage/OB 3/16\"Wire 5/16\" Screw",56.38,37,39.466000000000001]
["516TFBLL14DT","Deck Toggle-Swage/OB 1/4\"Wire 5/16\" Screw",64.06,37,44.841999999999999]
["38TFBLL14DT","Deck Toggle-Swage/OB 1/4\"Wire 3/8\" Screw ",75.319999999999993,37,52.72399999999999]
[null,null,null,null,""]
["Lifeline - Deck Toggle to (Machine) Swage (Forged Bronze TFB Series) - Metric Wire Sizes",null,null,null,""]
["14TFBLLM04DT","Deck Toggle-Swage/OB 4mm Wire 1/4\" Screw",38.369999999999997,37,26.858999999999998]
["14TFBLLM05DT","Deck Toggle-Swage/OB 5mm Wire 1/4\" Screw",39.6,37,27.72]
[null,null,null,null,""]
["Lifeline - Deck Toggle to (Handy Crimp) Swage (Forged Bronze TFB Series)",null,null,null,""]
["14TFBCLL18DT","Deck Toggle-Swage/OB/HC 1/8\"Wire 1/4\" Screw",41.54,37,29.077999999999996]
["14TFBCLL316DT","Deck Toggle-Swage/OB/HC 3/16\"Wire 1/4\" Screw",42.99,37,30.093]
["516TFBCLL316DT","Deck Toggle-Swage/OB/HC 3/16\"Wire 5/16\" Screw",59.45,37,41.615000000000002]
[null,null,null,null,""]
["Lifeline Studs (Machine Swage) - Imperial Wire Sizes",null,null,null,""]
["10LL18RH","Lifeline Stud 1/8\" Wire-10-32 x 1 3/4 RH",7.6,38,5.3199999999999994]
["10LL18LH","Lifeline Stud 1/8\" Wire-10-32 x 1 3/4 LH",7.6,38,5.3199999999999994]
["14LLE18RH","Lifeline Stud 1/8\" Wire-1/4-28 x 7/16 RH",7.07,38,4.9489999999999998]
["14LLE18LH","Lifeline Stud 1/8\" Wire-1/4-28 x 7/16 LH",7.07,38,4.9489999999999998]
["14LLP18LH","Lifeline Stud 1/8\" Wire-1/4-28 x1 1/2 LH",7.13,38,4.9909999999999997]
["14LL18RH","Lifeline Stud 1/8\" Wire-1/4-28 x2 1/4 RH",7.23,38,5.0609999999999999]
["14LL18LH","Lifeline Stud 1/8\" Wire-1/4-28 x2 1/4 LH",7.23,38,5.0609999999999999]
["14ASLL18RH","Lifeline Stud 1/8\" Wire-1/4-28 x3 1/4 RH",7.95,38,5.5649999999999995]
["14LLP532LH","Lifeline Stud 5/32\" Wire-1/4-28x1 1/2 LH",8.73,38,6.1109999999999998]
["14LL532RH","Lifeline Stud 5/32\" Wire-1/4-28x2 1/4 RH",8.32,38,5.8239999999999998]
["14LL532LH","Lifeline Stud 5/32\" Wire-1/4-28x2 1/4 LH",8.32,38,5.8239999999999998]
["14ASLL532RH","Lifeline Stud 5/32\" Wire-1/4-28x3 1/4 RH",10.02,38,7.0139999999999993]
["516LLE532RH","Lifeline Stud 5/32\" Wire-5/16-24x7/16 RH",8.14,38,5.6980000000000004]
["516LLE532LH","Lifeline Stud 5/32\" Wire-5/16-24x7/16 LH",8.14,38,5.6980000000000004]
["516LLP532RH","Lifeline Stud 5/32\" Wire-5/16-24x1 1/2RH",8.82,38,6.1739999999999995]
["516LLP532LH","Lifeline Stud 5/32\" Wire-5/16-24x1 1/2LH",8.82,38,6.1739999999999995]
["516LL532RH","Lifeline Stud 5/32\" Wire-5/16-24x2 3/8RH",8.32,38,5.8239999999999998]
["516LL532LH","Lifeline Stud 5/32\" Wire-5/16-24x2 3/8LH",9.06,38,6.3419999999999996]
["14LLP316LH","Lifeline Stud 3/16\" Wire-1/4-28 x1 1/2LH",9.36,38,6.5519999999999996]
["14LL316RH","Lifeline Stud 3/16\" Wire-1/4-28 x2 1/4RH",9.52,38,6.6639999999999997]
["14LL316LH","Lifeline Stud 3/16\" Wire-1/4-28 x2 1/4LH",9.52,38,6.6639999999999997]
["14ASLL316RH","Lifeline Stud 3/16\" Wire-1/4-28 x3 1/2RH",10.95,38,7.6649999999999991]
["516LLE316RH","Lifeline Stud 3/16\" Wire-5/16-24x7/16 RH ",8.8000000000000007,38,6.16]
["516LLE316LH","Lifeline Stud 3/16\" Wire-5/16-24x7/16 LH ",8.8000000000000007,38,6.16]
["516LLP316RH","Lifeline Stud 3/16\" Wire-5/16-24x1 1/2RH",8.74,38,6.1179999999999994]
["516LLP316LH","Lifeline Stud 3/16\" Wire-5/16-24x1 1/2LH",8.74,38,6.1179999999999994]
["516LL316RH","Lifeline Stud 3/16\" Wire-5/16-24x2 3/8RH",9.6300000000000008,38,6.7410000000000005]
["516LL316LH","Lifeline Stud 3/16\" Wire-5/16-24x2 3/8LH",9.6300000000000008,38,{"$f":"IF(ISBLANK(C1481),\"\",C1481*$E$5)","v":6.7410000000000005}]
["516LLE14RH","Lifeline Stud 1/4\" Wire-5/16-24x7/16 RH ",15.25,38,10.674999999999999]
["516LLE14LH","Lifeline Stud 1/4\" Wire-5/16-24x7/16 LH ",15.25,38,10.674999999999999]
["516LLP14RH","Lifeline Stud 1/4\" Wire-5/16-24x1 1/2 RH",15.97,38,11.179]
["516LLP14LH","Lifeline Stud 1/4\" Wire-5/16-24x1 1/2 LH",15.97,38,11.179]
["516LL14RH","Lifeline Stud 1/4\" Wire-5/16-24x2 3/8 RH",17.16,38,12.011999999999999]
["516LL14LH","Lifeline Stud 1/4\" Wire-5/16-24x2 3/8 LH",17.16,38,12.011999999999999]
["38LLE14RH","Lifeline Stud 1/4\" Wire-3/8-24x7/16 RH  ",15.25,38,10.674999999999999]
["38LLE14LH","Lifeline Stud 1/4\" Wire-3/8-24x7/16 LH  ",15.25,38,10.674999999999999]
["38LLP14RH","Lifeline Stud 1/4\" Wire-3/8-24x1 1/2 RH ",15.97,38,11.179]
["38LLP14LH","Lifeline Stud 1/4\" Wire-3/8-24x1 1/2 LH ",15.97,38,11.179]
["38LL14RH","Lifeline Stud 1/4\" Wire-3/8-24x2 3/4 RH ",17.16,38,12.011999999999999]
["38LL14LH","Lifeline Stud 1/4\" Wire-3/8-24x2 3/4 LH ",17.16,38,12.011999999999999]
[null,null,null,null,""]
["Lifeline Studs (Handy Crimp) - Imperial Sizes",null,null,null,""]
["14CLLE18RH","Lifeline Stud/HC 1/8\"Wire 1/4-28x7/16 RH",10.37,38,7.2589999999999986]
["14CLLE18LH","Lifeline Stud/HC 1/8\"Wire 1/4-28x7/16 LH",10.37,38,7.2589999999999986]
["14CLLP18RH","Lifeline Stud/HC 1/8\"Wire 1/4-28x1 1/2RH",10.97,38,7.6790000000000003]
["14CLLP18LH","Lifeline Stud/HC 1/8\"Wire 1/4-28x1 1/2LH",10.97,38,7.6790000000000003]
["14CLL18RH","Lifeline Stud/HC 1/8\"Wire 1/4-28x2 1/4RH",11.42,38,7.9939999999999998]
["14CLL18LH","Lifeline Stud/HC 1/8\"Wire 1/4-28x2 1/4LH",11.42,38,7.9939999999999998]
["14CLLP316RH","Lifeline Stud/HC 3/16\"Wire 1/4-28x1 1/2RH",12.55,38,8.7850000000000001]
["14CLLP316LH","Lifeline Stud/HC 3/16\"Wire 1/4-28x1 1/2LH",12.55,38,8.7850000000000001]
["14CLL316RH","Lifeline Stud/HC 3/16\"Wire 1/4-28x2 1/4RH",12.83,38,8.9809999999999999]
["14CLL316LH","Lifeline Stud/HC 3/16\"Wire 1/4-28x2 1/4LH",12.83,38,8.9809999999999999]
["14ASCLL316RH","Lifeline Stud/HC 3/16\"Wire 1/4-28x3 1/4RH",15.53,38,10.870999999999999]
["516CLLE316RH","Lifeline Stud/HC 3/16\"Wire 5/16-24x7/16RH",11.87,38,8.3089999999999993]
["516CLLE316LH","Lifeline Stud/HC 3/16\"Wire 5/16-24x7/16LH",11.87,38,8.3089999999999993]
["516CLLP316RH","Lifeline Stud/HC 3/16\"WRE 5/16-24x1 1/2RH",12.2,38,8.5399999999999991]
["516CLLP316LH","Lifeline Stud/HC 3/16\"WRE 5/16-24x1 1/2LH",12.2,38,8.5399999999999991]
["516CLL316RH","Lifeline Stud/HC 3/16\"WRE 5/16-24x2 3/8RH",12.65,38,8.8550000000000004]
["516CLL316LH","Lifeline Stud/HC 3/16\"WRE 5/16-24x2 3/8LH",12.65,38,8.8550000000000004]
[null,null,null,null,""]
["Lifeline Studs (Machine Swage) - Metric Wire Sizes",null,null,null,""]
["14LLEM03RH","Lifeline Stud 3mm Wire-1/4-28 x 7/16 RH",7.61,39,5.327]
["14LLEM03LH","Lifeline Stud 3mm Wire-1/4-28 x 7/16 LH",7.61,39,5.327]
["14LLPM03LH","Lifeline Stud 3mm Wire-1/4-28 x1 1/2 LH",7.07,39,4.9489999999999998]
["14LLM03RH","Lifeline Stud 3mm Wire-1/4-28 x2 1/4 RH",7.23,39,5.0609999999999999]
["14LLM03LH","Lifeline Stud 3mm Wire-1/4-28 x2 1/4 LH",7.23,39,5.0609999999999999]
["14ASLLM03RH","Lifeline Stud 3mm Wire-1/4-28 x3 1/4 RH",7.94,39,5.5579999999999998]
["14LLPM04LH","Lifeline Stud 4mm Wire-1/4-28x1 1/2 LH",8.74,39,6.1179999999999994]
["14LLM04RH","Lifeline Stud 4mm Wire-1/4-28x2 1/4 RH",8.31,39,5.8170000000000002]
["14LLM04LH","Lifeline Stud 4mm Wire-1/4-28x2 1/4 LH",8.31,39,5.8170000000000002]
["516LLEM04RH","Lifeline Stud 4mm Wire-5/16-24x7/16 RH",8.15,39,5.7050000000000001]
["516LLEM04LH","Lifeline Stud 4mm Wire-5/16-24x7/16 LH",8.15,39,5.7050000000000001]
["516LLM04RH","Lifeline Stud 4mm Wire-5/16-24x2 3/8 RH",9.0500000000000007,39,6.335]
["516LLM04LH","Lifeline Stud 4mm Wire-5/16-24x2 3/8 LH",9.0500000000000007,39,6.335]
["14LLPM05LH","Lifeline Stud 5mm Wire-1/4-28x1 1/2 LH",9.36,39,6.5519999999999996]
["14LLM05RH","Lifeline Stud 5mm Wire-1/4-28 x2 1/4 RH",9.52,39,6.6639999999999997]
["14LLM05LH","Lifeline Stud 5mm Wire-1/4-28 x2 1/4 LH",9.52,39,6.6639999999999997]
["516LLEM05RH","Lifeline Stud 5mm Wire-5/16-24x7/16 RH ",8.8000000000000007,39,6.16]
["516LLEM05LH","Lifeline Stud 5mm Wire-5/16-24x7/16 LH ",8.8000000000000007,39,6.16]
["516LLM05RH","Lifeline Stud 5mm Wire-5/16-24x2 3/8RH",9.6300000000000008,39,6.7410000000000005]
["516LLM05LH","Lifeline Stud 5mm Wire-5/16-24x2 3/8LH",9.6300000000000008,39,6.7410000000000005]
["516LLEM06RH","Lifeline Stud 6mm Wire-5/16-24x7/16 RH ",15.24,39,10.667999999999999]
["516LLEM06LH","Lifeline Stud 6mm Wire-5/16-24x7/16 LH ",15.24,39,10.667999999999999]
["516LLM06RH","Lifeline Stud 6mm Wire-5/16-24x2 3/8 RH",17.170000000000002,39,12.019]
["516LLM06LH","Lifeline Stud 6mm Wire-5/16-24x2 3/8 LH",17.170000000000002,39,12.019]
["38LLEM06RH","Lifeline Stud 6mm Wire-3/8-24x7/16 RH  ",15.24,39,10.667999999999999]
["38LLEM06LH","Lifeline Stud 6mm Wire-3/8-24x7/16 LH  ",15.24,39,10.667999999999999]
["38LLM06RH","Lifeline Stud 6mm Wire-3/8-24x2 3/4 RH ",17.170000000000002,39,12.019]
["38LLM06LH","Lifeline Stud 6mm Wire-3/8-24x2 3/4 LH ",17.170000000000002,39,12.019]
[null,null,null,null,""]
["Lifeline Studs (Machine Swage) - Metric Threads",null,null,null,""]
["6MLL18RH","Lifeline Stud 1/4\" Wire-6mm x 2 1/4 RH  ",10.78,39,{"$f":"IF(ISBLANK(C1545),\"\",C1545*$E$5)","v":7.5459999999999994}]
["6MLL18LH","Lifeline Stud 1/4\" Wire-6mm x 2 1/4 LH  ",10.78,39,7.5459999999999994]
["6MLL532RH","Lifeline Stud 5/32\" Wire-6mm x 2 1/4 RH ",13.44,39,9.4079999999999995]
["6MLL532LH","Lifeline Stud 5/32\" Wire-6mm x 2 1/4 LH ",13.44,39,9.4079999999999995]
["6MLL316RH","Lifeline Stud 3/16\" Wire-6mm x 2 1/4 RH ",13.11,39,9.1769999999999996]
["6MLL316LH","Lifeline Stud 3/16\" Wire-6mm x 2 1/4 LH ",13.11,39,9.1769999999999996]
["8MLL532RH","Lifeline Stud 5/32\" Wire-8mm x 2 3/8 RH ",13.11,39,9.1769999999999996]
["8MLL532LH","Lifeline Stud 5/32\" Wire-8mm x 2 3/8 LH ",13.11,39,9.1769999999999996]
["8MLL316RH","Lifeline Stud 3/16\" Wire-8mm x 2 3/8 RH ",13.4,39,9.379999999999999]
["8MLL316LH","Lifeline Stud 3/16\" Wire-8mm x 2 3/8 LH ",13.4,39,9.379999999999999]
["8MLL14RH","Lifeline Stud 1/4\" Wire-8mm x 2 3/8 RH  ",23.1,39,16.170000000000002]
["8MLL14LH","Lifeline Stud 1/4\" Wire-8mm x 2 3/8 LH  ",23.1,39,16.170000000000002]
[null,null,null,null,""]
["Lifeline - Toggle Jaw(Machine Swage) - Forged T-Bolt Style - Imperial Wire Sizes",null,null,null,""]
["14TJLL18","Lifeline Toggle Jaw 1/8\" Wire 1/4\" Pin  ",13.78,40,9.645999999999999]
["14TJLL532","Lifeline Toggle Jaw 5/32\" Wire 1/4\" Pin ",14.54,40,10.177999999999999]
["14TJLL316","Lifeline Toggle Jaw 3/16\" Wire 1/4\" Pin ",14.54,40,10.177999999999999]
["516TJLL316","Lifeline Toggle Jaw 3/16\" Wire 5/16\" Pin",20.77,40,14.538999999999998]
["516TJLL14","Lifeline Toggle Jaw 1/4\" Wire 5/16\" Pin ",21.04,40,14.727999999999998]
["38TJLL14","Lifeline Toggle Jaw 1/4\" Wire 3/8\" Pin  ",23.14,40,16.198]
[null,null,null,null,""]
["Lifeline - Toggle Jaw(Machine Swage) - Forged T-Bolt Style - Metric Wire Sizes",null,null,null,""]
["14TJLLM04","Lifeline Toggle Jaw 4mm Wire 1/4\" Pin ",14.54,40,10.177999999999999]
["14TJLLM05","Lifeline Toggle Jaw 5mm Wire 1/4\" Pin ",14.54,40,10.177999999999999]
[null,null,null,null,""]
["Lifeline - Toggle Jaw(Handy Crimp) - Forged T-Bolt Style",null,null,null,""]
["14TJCLL18","Lifeline Toggle Jaw/HC 1/8\"Wire 1/4\" Pin",20.399999999999999,40,14.279999999999998]
["14TJCLL316","Lifeline Toggle Jaw/HC 3/16\"WIR 1/4\" Pin",20.74,40,14.517999999999997]
["516TJCLL316","Lifeline Toggle Jaw/HC 3/16\"Wire 5/16\"PI",21.84,40,15.287999999999998]
[null,null,null,null,""]
["Termination Studs - Machine Swage",null,null,null,""]
["TSLL18","Termination Stud 1/8\" Wire - 1/2\" Head  ",7.3,40,5.1099999999999994]
["TSLL532","Termination Stud 5/32\" Wire - 9/16\" Head",11.6,40,8.1199999999999992]
["TSLL316","Termination Stud 3/16\" Wire - 9/16\" Head",11.6,40,8.1199999999999992]
["TSLL14","Termination Stud 1/4\" Wire - 9/16\" Head ",21.29,40,14.902999999999999]
[null,null,null,null,""]
["Termination Studs - Metric Wire Sizes",null,null,null,""]
["TSLLM04","Termination Stud 4mm Wire - 9/16\" Head",11.6,40,8.1199999999999992]
["TSLLM05","Termination Stud 5mm Wire - 9/16\" Head",11.6,40,8.1199999999999992]
[null,null,null,null,""]
["Termination Studs - Handy Crimp",null,null,null,""]
["TSCLL18","Termination Stud Handy Crimp 1/8\" Wire  ",12.38,40,8.6660000000000004]
["TSCLL316","Termination Stud Handy Crimp 3/16\" Wire ",14.26,40,9.9819999999999993]
[null,null,null,null,""]
["Lifeline - Threaded Gate Eye - Single (Machine Swage) - Imperial Wire Sizes",null,null,null,""]
["14ELLS18","Lifeline Gate Eye Thd Type Single 1/8\" Wire",17.8,41,12.459999999999999]
["516ELLS532","Lifeline Gate Eye Thd Type Single 5/32\" WIR",19.93,41,13.950999999999999]
["516ELLS316","Lifeline Gate Eye Thd Type Single 3/16\" WIR",19.93,41,13.950999999999999]
["38ELLS14","Lifeline Gate Eye Thd Type Single 1/4\" Wire",22.21,41,15.546999999999999]
[null,null,null,null,""]
["Lifeline - Threaded Gate Eye - Single (Machine Swage) - Metric Wire Sizes",null,null,null,""]
["516ELLSM04","Lifeline Gate Eye Thd Type Single 4mm WIR",19.93,41,13.950999999999999]
["516ELLSM05","Lifeline Gate Eye Thd Type Single 5mm WIR",19.93,41,13.950999999999999]
[null,null,null,null,""]
["Lifeline - Threaded Gate Eye - Single (Handy Crimp)",null,null,null,""]
["14ECLLS18","Lifeline Gate Eye Thd Type Single HC 1/8\" W",24.28,41,16.995999999999999]
["516ECLLS316","Lifeline Gate Eye Thd Type Single HC 3/16 W",25.78,41,18.045999999999999]
[null,null,null,null,""]
["Lifeline - Threaded Gate Eye - Interlocking Eyes (Machine Swage) - Imperial Wire Sizes",null,null,null,""]
["14ELLI18","Lifeline Gate Eye Thd Type Inter 1/8\" Wire",35.61,41,24.927]
["516ELLI532","Lifeline Gate Eye Thd Type Inter 5/32\" Wire",39.86,41,27.901999999999997]
["516ELLI316","Lifeline Gate Eye Thd Type Inter 3/16\" Wire",39.86,41,27.901999999999997]
["38ELLI14","Lifeline Gate Eye Thd Type Inter 1/4\" Wire",52.84,41,36.988]
[null,null,null,null,""]
["Lifeline - Threaded Gate Eye - Interlocking Eyes (Machine Swage) - Metric Wire Sizes",null,null,null,{"$f":"IF(ISBLANK(C1609),\"\",C1609*$E$5)","v":""}]
["516ELLIM04","Lifeline Gate Eye Thd Type Inter 4mm WIR",39.86,41,27.901999999999997]
["516ELLIM05","Lifeline Gate Eye Thd Type Inter 5mm WIR",39.86,41,27.901999999999997]
[null,null,null,null,""]
["Lifeline - Threaded Gate Eye - Interlocking Eyes (Handy Crimp)",null,null,null,""]
["14ECLLI18","Lifeline Gate Eye Thd Type Inter HC 1/8 WR",48.57,41,33.998999999999995]
["516ECLLI316","Lifeline Gate Eye Thd Type Inter HC 3/16 W",51.53,41,36.070999999999998]
[null,null,null,null,""]
["Lifeline - Swivel Gate Eye - Single (Machine Swage) - Imperial Wire Sizes",null,null,null,""]
["SWELLS18","Lifeline Gate Eye Single 1/8\" Wire      ",15.55,41,10.885]
["SWELLS532","Lifeline Gate Eye Single 5/32\" Wire     ",17.920000000000002,41,12.544]
["SWELLS316","Lifeline Gate Eye Single 3/16\" Wire     ",17.920000000000002,41,12.544]
["SWELLS14","Lifeline Gate Eye Single 1/4\" Wire      ",29.87,41,20.908999999999999]
[null,null,null,null,""]
["Lifeline - Swivel Gate Eye - Single (Machine Swage) - Metric Wire Sizes",null,null,null,""]
["SWELLSM04","Lifeline Gate Eye Single 4mm Wire     ",17.920000000000002,41,12.544]
["SWELLSM05","Lifeline Gate Eye Single 5mm Wire     ",17.920000000000002,41,12.544]
[null,null,null,null,""]
["Lifeline - Swivel Gate Eye - Single (Handy Crimp)",null,null,null,""]
["SWECLLS18","Lifeline Gate Eye Single /HC 1/8\" Wire  ",22.53,41,15.770999999999999]
["SWECLLS316","Lifeline Gate Eye Single /HC 3/16\" Wire ",23,41,16.099999999999998]
[null,null,null,null,""]
["Lifeline - Swivel Gate Eye - Interlocking Eyes (Machine Swage) - Imperial Wire Sizes",null,null,null,""]
["SWELLI18","Lifeline Gate Eye Inter 1/8\" Wire       ",30.73,41,21.510999999999999]
["SWELLI532","Lifeline Gate Eye Inter 5/32\" Wire      ",35.6,41,24.919999999999998]
["SWELLI316","Lifeline Gate Eye Inter 3/16\" Wire      ",35.6,41,24.919999999999998]
["SWELLI14","Lifeline Gate Eye Inter 1/4\" Wire       ",59.26,41,41.481999999999999]
[null,null,null,null,""]
["Lifeline - Swivel Gate Eye - Interlocking Eyes (Machine Swage) - Metric Wire Sizes",null,null,null,""]
["SWELLIM04","Lifeline Gate Eye Inter 4mm Wire      ",35.6,41,24.919999999999998]
["SWELLIM05","Lifeline Gate Eye Inter 5mm Wire      ",35.6,41,24.919999999999998]
[null,null,null,null,""]
["Lifeline - Swivel Gate Eye - Interlocking Eyes (Handy Crimp)",null,null,null,""]
["SWECLLI18","Lifeline Gate Eye Inter /HC 1/8\" Wire   ",45.05,41,31.534999999999997]
["SWECLLI316","Lifeline Gate Eye Inter /HC 3/16\" Wire  ",46.04,41,32.227999999999994]
[null,null,null,null,""]
["Lifeline - Adjuster - Short (Machine Swage) - Imperial Wire Sizes",null,null,null,""]
["14ALL18","Lifeline Adjuster 1/8\" Wire - 1/4\" Pin  ",20,42,14]
["14ALL532","Lifeline Adjuster 5/32\" Wire - 1/4\" Pin ",20.75,42,14.524999999999999]
["14ALL316","Lifeline Adjuster 3/16\" Wire - 1/4\" Pin ",20.75,42,14.524999999999999]
["14ALL14","Lifeline Adjuster 1/4\" Wire - 1/4\" Pin  ",30.27,42,21.189]
[null,null,null,null,""]
["Lifeline - Adjuster - Short (Machine Swage) - Metric Wire Sizes",null,null,null,""]
["14ALLM04","Lifeline Adjuster 4mm Wire - 1/4\" Pin ",20.010000000000002,42,14.007]
["14ALLM05","Lifeline Adjuster 5mm Wire - 1/4\" Pin ",20.76,42,14.532]
[null,null,null,null,""]
["Lifeline - Adjuster - Short (Handy Crimp)",null,null,null,""]
["14ACLL18","Lifeline Adjuster/HC 1/8\" Wire-1/4\" Pin ",23.46,42,16.422000000000001]
["14ACLL316","Lifeline Adjuster/HC 3/16\" Wire-1/4\" Pin",26.23,42,18.361000000000001]
[null,null,null,null,""]
["Lifeline - Adjuster - Long (Machine Swage) - Imperial Wire Sizes",null,null,null,""]
["10SALL18","Lifeline Adjuster/Lng 1/8\" Wire-3/16\" Pin",24.26,42,16.981999999999999]
["14SALL18","Lifeline Adjuster/Lng 1/8\" Wire-1/4\" Pin ",28.53,42,19.971]
["14SALL532","Lifeline Adjuster/Lng 5/32\"Wire-1/4\" Pin",31.99,42,22.392999999999997]
["14SALL316","Lifeline Adjuster/Lng 3/16\"Wire-1/4\" Pin",31.99,42,22.392999999999997]
[null,null,null,null,""]
["Lifeline - Adjuster - Long (Machine Swage) - Metric Wire Sizes",null,null,null,""]
["14SALLM03","Lifeline Adjuster/Lng 3mm Wire-1/4 Pin ",28.53,42,19.971]
["14SALLM04","Lifeline Adjuster/Lng 4mm Wire-1/4\" Pin",31.99,42,22.392999999999997]
["14SALLM05","Lifeline Adjuster/Lng 5mmWire-1/4\" Pin",31.99,42,22.392999999999997]
[null,null,null,null,""]
["Lifeline - Adjuster - Long (Handy Crimp)",null,null,null,""]
["14SACLL316","Lifeline Adjuster/Lng/HC 3/16\" Wire     ",41.81,42,29.266999999999999]
[null,null,null,null,""]
["Lifeline - 4 Inch Positive Locking Pelican Hook (Machine Swage) - Imperial Wire Sizes",null,null,null,{"$f":"IF(ISBLANK(C1673),\"\",C1673*$E$5)","v":""}]
["FPHLL18","Pelican Hook Pos/Lock 4\" x 1/8\" Wire    ",40.54,43,28.377999999999997]
["FPHLL532","Pelican Hook Pos/Lock 4\" x 5/32\" Wire   ",42.15,43,29.504999999999995]
["FPHLL316","Pelican Hook Pos/Lock 4\" x 3/16\" Wire   ",42.15,43,29.504999999999995]
["FPHLL14","Pelican Hook Pos/Lock 4\" x 1/4\" Wire    ",48.65,43,34.055]
[null,null,null,null,""]
["Lifeline - 4 Inch Positive Locking Pelican Hook (Machine Swage) - Metric Wire Sizes",null,null,null,""]
["FPHLLM04","Pelican Hook Pos/Lock 4\" x 4mm Wire   ",42.14,43,29.497999999999998]
["FPHLLM05","Pelican Hook Pos/Lock 4\" x 5mm Wire   ",42.14,43,29.497999999999998]
["FPHLLM06","Pelican Hook Pos/Lock 4\" x 6mm Wire    ",48.65,43,34.055]
[null,null,null,null,""]
["Lifeline - 4 Inch Positive Locking Pelican Hook (Handy Crimp)",null,null,null,""]
["FPHCLL18","Pelican Hook Pos/Lock/HC 4\" x 1/8\" Wire ",48.16,43,33.711999999999996]
["FPHCLL316","Pelican Hook Pos/Lock/HC 4\" x 3/16\" Wire",46.6,43,32.619999999999997]
[null,null,null,null,""]
["Lifeline - 3 Inch Positive Locking Pelican Hook (Machine Swage) - Imperial Wire Sizes",null,null,null,""]
["FPHLL183","Pelican Hook Pos/Lock 3\" x 1/8\" Wire    ",40.54,43,28.377999999999997]
["FPHLL5323","Pelican Hook Pos/Lock 3\" x 5/32\" Wire   ",40.54,43,28.377999999999997]
["FPHLL3163","Pelican Hook Pos/Lock 3\" x 3/16\" Wire   ",40.54,43,28.377999999999997]
[null,null,null,null,""]
["Lifeline - 3 Inch Positive Locking Pelican Hook (Machine Swage) - Metric Wire Sizes",null,null,null,""]
["FPHLLM033","Pelican Hook Pos/Lock 3\" x 3mm Wire    ",40.54,43,28.377999999999997]
["FPHLLM043","Pelican Hook Pos/Lock 3\" x 4mm Wire   ",40.54,43,28.377999999999997]
["FPHLLM053","Pelican Hook Pos/Lock 3\" x 5mm Wire   ",40.54,43,28.377999999999997]
[null,null,null,null,""]
["Lifeline - 3 Inch Positive Locking Pelican Hook (Handy Crimp)",null,null,null,""]
["FPHCLL183","Pelican Hook Pos/Lock/HC 3\" x 1/8\" Wire ",49.07,43,34.348999999999997]
["FPHCLL3163","Pelican Hook Pos/Lock/HC 3\" x 3/16\" Wire",50.68,43,35.475999999999999]
[null,null,null,null,""]
["Replacement Parts Section",null,null,null,""]
[null,null,null,null,""]
["Replacement Threaded T-Bolt Toggle Jaw",null,null,null,""]
["10TJRH-P","Threaded T-Bolt Toggle Jaw 10-32 RH-NPH",8.07,45,5.649]
["10TJRH","Threaded T-Bolt Toggle Jaw 10-32 RH     ",8.07,45,5.649]
["10TJLH-P","Threaded T-Bolt Toggle Jaw 10-32 LH-NPH",8.07,45,5.649]
["10TJLH","Threaded T-Bolt Toggle Jaw 10-32 LH     ",8.07,45,5.649]
["14TJRH-P","Threaded T-Bolt Toggle Jaw 1/4-28 RH-NPH",9.6999999999999993,45,6.7899999999999991]
["14TJRH","Threaded T-Bolt Toggle Jaw 1/4-28 RH    ",9.6999999999999993,45,6.7899999999999991]
["14TJLH-P","Threaded T-Bolt Toggle Jaw 1/4-28 LH-NPH",9.6999999999999993,45,6.7899999999999991]
["14TJLH","Threaded T-Bolt Toggle Jaw 1/4-28 LH    ",9.6999999999999993,45,6.7899999999999991]
["516TJRH-P","Threaded T-Bolt Toggle Jaw 5/16-24 RH-NPH",18.350000000000001,45,12.845000000000001]
["516TJRH","Threaded T-Bolt Toggle Jaw 5/16-24 RH   ",18.350000000000001,45,12.845000000000001]
["516TJLH-P","Threaded T-Bolt Toggle Jaw 5/16-24 LH-NPH",18.350000000000001,45,12.845000000000001]
["516TJLH","Threaded T-Bolt Toggle Jaw 5/16-24 LH   ",18.350000000000001,45,12.845000000000001]
["38TJRH-P","Threaded T-Bolt Toggle Jaw 3/8-24 RH-NPH",23.48,45,16.436]
["38TJRH","Threaded T-Bolt Toggle Jaw 3/8-24 RH    ",23.49,45,16.442999999999998]
["38TJLH-P","Threaded T-Bolt Toggle Jaw 3/8-24 LH-NPH",23.48,45,16.436]
["38TJLH","Threaded T-Bolt Toggle Jaw 3/8-24 LH    ",23.49,45,16.442999999999998]
["12TJRH-P","Threaded T-Bolt Toggle Jaw 1/2-20 RH-NPH",42.08,45,29.455999999999996]
["12TJRH","Threaded T-Bolt Toggle Jaw 1/2-20 RH    ",42.07,45,29.448999999999998]
["12TJLH-P","Threaded T-Bolt Toggle Jaw 1/2-20 LH-NPH",42.08,45,29.455999999999996]
["12TJLH","Threaded T-Bolt Toggle Jaw 1/2-20 LH    ",42.07,45,29.448999999999998]
["58TJRH-P","Threaded T-Bolt Toggle Jaw 5/8-18 RH-NPH",65.989999999999995,45,46.192999999999991]
["58TJRH","Threaded T-Bolt Toggle Jaw 5/8-18 RH    ",65.989999999999995,45,46.192999999999991]
["58TJLH-P","Threaded T-Bolt Toggle Jaw 5/8-18 LH-NPH",65.989999999999995,45,46.192999999999991]
["58TJLH","Threaded T-Bolt Toggle Jaw 5/8-18 LH    ",65.989999999999995,45,46.192999999999991]
["34TJRH-P","Threaded T-Bolt Toggle Jaw 3/4-16 RH-NPH",161.37,45,112.95899999999999]
["34TJRH","Threaded T-Bolt Toggle Jaw 3/4-16 RH    ",161.38,45,112.96599999999999]
["34TJLH-P","Threaded T-Bolt Toggle Jaw 3/4-16 LH-NPH  ",161.37,45,112.95899999999999]
["34TJLH","Threaded T-Bolt Toggle Jaw 3/4-16 LH    ",161.38,45,112.96599999999999]
[null,null,null,null,""]
["Replacement Forged T-Bolts",null,null,null,""]
["14TRH-P","Forged T-Bolt - 1/4-28 X 2 1/4\" RH-NPH",5.13,45,3.5909999999999997]
["14TRH","Forged T-Bolt - 1/4-28 X 2 1/4\" RH      ",5.13,45,3.5909999999999997]
["14TLH-P","Forged T-Bolt - 1/4-28 X 2 1/4\" LH-NPH      ",5.13,45,{"$f":"IF(ISBLANK(C1737),\"\",C1737*$E$5)","v":3.5909999999999997}]
["14TLH","Forged T-Bolt - 1/4-28 X 2 1/4\" LH      ",5.13,45,3.5909999999999997]
["516TRH-P","Forged T-Bolt - 5/16-24 X 2 1/2\" RH-NPH     ",8.92,45,6.2439999999999998]
["516TRH","Forged T-Bolt - 5/16-24 X 2 1/2\" RH     ",8.92,45,6.2439999999999998]
["516TLH-P","Forged T-Bolt - 5/16-24 X 2 1/2\" LH-NPH     ",8.92,45,6.2439999999999998]
["516TLH","Forged T-Bolt - 5/16-24 X 2 1/2\" LH     ",8.92,45,6.2439999999999998]
["38TRH-P","Forged T-Bolt - 3/8-24 X 2 3/4\" RH-NPH      ",13.51,45,9.456999999999999]
["38TRH","Forged T-Bolt - 3/8-24 X 2 3/4\" RH      ",13.51,45,9.456999999999999]
["38TLH-P","Forged T-Bolt - 3/8-24 X 2 3/4\" RH-NPH      ",13.51,45,9.456999999999999]
["38TLH","Forged T-Bolt - 3/8-24 X 2 3/4\" LH      ",13.51,45,9.456999999999999]
["12TRH-P","Forged T-Bolt - 1/2-20 X 3 1/4\" LH-NPH      ",18.350000000000001,45,12.845000000000001]
["12TRH","Forged T-Bolt - 1/2-20 X 3 1/4\" RH      ",18.350000000000001,45,12.845000000000001]
["12TLH-P","Forged T-Bolt - 1/2-20 X 3 1/4\" LH-NPH      ",18.350000000000001,45,12.845000000000001]
["12TLH","Forged T-Bolt - 1/2-20 X 3 1/4\" LH      ",18.350000000000001,45,12.845000000000001]
["58TRH-P","Forged T-Bolt - 5/8-18 X 3 3/4\" RH-NPH      ",35.65,45,24.954999999999998]
["58TRH","Forged T-Bolt - 5/8-18 X 3 3/4\" RH      ",35.65,45,24.954999999999998]
["58TLH-P","Forged T-Bolt - 5/8-18 X 3 3/4\" LH-NPH     ",35.65,45,24.954999999999998]
["58TLH","Forged T-Bolt - 5/8-18 X 3 3/4\" LH      ",35.65,45,24.954999999999998]
["34TRH-P","Forged T-Bolt - 3/4-16 x 5.0\" RH-NPH             ",74.63,45,52.240999999999993]
["34TRH","Forged T-Bolt - 3/4-16 x 5.0\" RH        ",74.63,45,52.240999999999993]
["34TLH-P","Forged T-Bolt - 3/4-16 x 5.0\" LH-NPH             ",74.63,45,52.240999999999993]
["34TLH","Forged T-Bolt - 3/4-16 x 5.0\" LH        ",74.63,45,52.240999999999993]
[null,null,null,null,""]
["Replacement Toggle Straps (Stampings)",null,null,null,""]
["14ST","Stamping, Toggle - 1/4\" Pin - 1/4\" Jaw  ",2.6,45,1.8199999999999998]
["516ST","Stamping, Toggle - 5/16\" Pin - 5/16\" Jaw",3.91,45,2.7370000000000001]
["38ST","Stamping, Toggle - 3/8\" Pin - 3/8\" Jaw  ",4.47,45,3.1289999999999996]
["12ST","Stamping, Toggle - 1/2\" Pin - 1/2\" Jaw  ",12.97,45,9.0790000000000006]
["58ST","Stamping, Toggle - 5/8\" Pin - 5/8\" Jaw  ",25.94,45,18.158000000000001]
["34ST","Stamping, Toggle - 3/4\" Pin - 3/4\" Jaw  ",61.53,45,43.070999999999998]
["78ST","Stamping, Toggle - 7/8\" Pin - 7/8\" Jaw  ",172.04,45,120.42799999999998]
["1ST","Stamping, Toggle - 1.0\" Pin - 1.0\" Jaw  ",235.12,45,164.584]
[null,null,null,null,""]
["Replacement Eye Toggle Straps (Stampings)",null,null,null,""]
["14EST","Stamping, Eye Toggle-1/4\" Pin-1/4\" Jaw  ",2.6,45,1.8199999999999998]
["516EST","Stamping, Eye Toggle-5/16\" Pin-5/16\" Jaw",3.91,45,2.7370000000000001]
["38EST","Stamping, Eye Toggle 3/8\" Pin-3/8\" Jaw  ",4.47,45,3.1289999999999996]
["12EST","Stamping, Eye Toggle 1/2\" Pin-1/2\" Jaw ",12.97,45,9.0790000000000006]
["58EST","Stamping, Eye Toggle 5/8\" Pin-5/8\" Jaw  ",25.94,45,18.158000000000001]
["34EST","Stamping, Eye Toggle 3/4\" Pin-3/4\" Jaw ",70.77,45,49.538999999999994]
["78EST","Stamping, Eye Toggle 7/8\" Pin-7/8\" Jaw  ",200.71,45,140.49699999999999]
["1EST","Stamping, Eye Toggle 1.0\" Pin-1.0\" Jaw  ",235.12,45,164.584]
[null,null,null,null,""]
["Replacement Deck Toggle Straps (Stampings)",null,null,null,""]
[null,"Stamping, Deck Toggle 1/4\" T-Bolt",2.68,45,1.8759999999999999]
["516STDT","Stamping, Deck Toggle 5/16\" T-Bolt      ",4.59,45,3.2129999999999996]
["38STDT","Stamping, Deck Toggle 3/8\" T-Bolt       ",5.32,45,3.7239999999999998]
[null,null,null,null,""]
["Replacement Eye Toggle - Toggle Jaws",null,null,null,""]
["14ETJRH-P","Eye Toggle Jaw, Thd 1/4-28 RH x 1/4\" Pin-NPH",17.32,46,12.123999999999999]
["14ETJRH","Eye Toggle Jaw, Thd 1/4-28 RH x 1/4\" Pin",17.309999999999999,46,12.116999999999999]
["14ETJLH-P","Eye Toggle Jaw, Thd 1/4-28 LH x 1/4\" Pin-NPH",17.309999999999999,46,12.116999999999999]
["14ETJLH","Eye Toggle Jaw, Thd 1/4-28 LH x 1/4\" Pin",17.309999999999999,46,12.116999999999999]
["516ETJRH-P","Eye Toggle Jaw, Thd 5/16-24 RH x5/16 Pin-NPH",20.51,46,14.356999999999999]
["516ETJRH","Eye Toggle Jaw, Thd 5/16-24 RH x5/16 Pin",20.51,46,14.356999999999999]
["516ETJLH-P","Eye Toggle Jaw, Thd 5/16-24 LH x5/16 Pin-NPH",20.51,46,14.356999999999999]
["516ETJLH","Eye Toggle Jaw, Thd 5/16-24 LH x5/16 Pin",20.51,46,14.356999999999999]
["38ETJRH-P","Eye Toggle Jaw, Thd 3/8-24 RH x 3/8 Pin-NPH",25.95,46,18.164999999999999]
["38ETJRH","Eye Toggle Jaw, Thd 3/8-24 RH x 3/8 Pin ",25.95,46,18.164999999999999]
["38ETJLH-P","Eye Toggle Jaw, Thd 3/8-24 LH x 3/8 Pin-NPH ",25.95,46,18.164999999999999]
["38ETJLH","Eye Toggle Jaw, Thd 3/8-24 LH x 3/8 Pin ",25.95,46,18.164999999999999]
["12ETJRH-P","Eye Toggle Jaw, Thd 1/2-20 RH x 1/2 Pin-NPH ",48.29,46,33.802999999999997]
["12ETJRH","Eye Toggle Jaw, Thd 1/2-20 RH x 1/2 Pin ",48.28,46,33.795999999999999]
["12ETJLH-P","Eye Toggle Jaw, Thd 1/2-20 LH x 1/2 Pin-NPH ",48.29,46,33.802999999999997]
["12ETJLH","Eye Toggle Jaw, Thd 1/2-20 LH x 1/2 Pin ",48.28,46,{"$f":"IF(ISBLANK(C1801),\"\",C1801*$E$5)","v":33.795999999999999}]
["58ETJRH-P","Eye Toggle Jaw, Thd 5/8-18 RH x 5/8 Pin-NPH ",83.99,46,58.792999999999992]
["58ETJRH","Eye Toggle Jaw, Thd 5/8-18 RH x 5/8 Pin ",83.98,46,58.786000000000001]
["58ETJLH-P","Eye Toggle Jaw, Thd 5/8-18 LH x 5/8 Pin-NPH ",83.99,46,58.792999999999992]
["58ETJLH","Eye Toggle Jaw, Thd 5/8-18 LH x 5/8 Pin ",83.98,46,58.786000000000001]
["34ETJRH-P","Eye Toggle Jaw, Thd 3/4-16 RH x 3/4 Pin-NPH",164.41,46,115.08699999999999]
["34ETJRH","Eye Toggle Jaw, Thd 3/4-16 RH x 3/4 Pin",164.41,46,115.08699999999999]
["34ETJLH-P","Eye Toggle Jaw, Thd 3/4-16 LH x 3/4 Pin-NPH",164.41,46,115.08699999999999]
["34ETJLH","Eye Toggle Jaw, Thd 3/4-16 LH x 3/4 Pin",164.41,46,115.08699999999999]
["78ETJRH-P","Eye Toggle Jaw, Thd 7/8-14 RH x 7/8\" Pin-NPH",442.38,46,309.666]
["78ETJRH","Eye Toggle Jaw, Thd 7/8-14 RH x 7/8\" Pin",442.38,46,309.666]
["78ETJLH-P","Eye Toggle Jaw, Thd 7/8-14 LH x 7/8\" Pin-NPH",442.38,46,309.666]
["78ETJLH","Eye Toggle Jaw, Thd 7/8-14 LH x 7/8\" Pin",442.38,46,309.666]
["1ETJRH-P","Eye Toggle Jaw, Thd 1-12 RH x 1.0\" Pin-NPH",676.72,46,473.70400000000001]
["1ETJRH","Eye Toggle Jaw, Thd 1-12 RH x 1.0\" Pin",676.72,46,473.70400000000001]
["1ETJLH-P","Eye Toggle Jaw, Thd 1-12 LH x 1.0\" Pin-NPH",676.72,46,473.70400000000001]
["1ETJLH","Eye Toggle Jaw, Thd 1-12 LH x 1.0\" Pin",676.72,46,473.70400000000001]
[null,null,null,null,""]
["Replacement Eye Rods - Rigging",null,null,null,""]
["14ERRH-P","Eye Rod - Rigging 1/4\" Hole 1/4-28 RH-NPH   ",10.26,46,7.1819999999999995]
["14ERRH","Eye Rod - Rigging 1/4\" Hole 1/4-28 RH   ",10.26,46,7.1819999999999995]
["14ERLH-P","Eye Rod - Rigging 1/4\" Hole 1/4-28 LH-NPH  ",10.26,46,7.1819999999999995]
["14ERLH","Eye Rod - Rigging 1/4\" Hole 1/4-28 LH   ",10.26,46,7.1819999999999995]
["516ERRH-P","Eye Rod - Rigging 5/16\" Hole 5/16-24 RH-NPH ",11.07,46,7.7489999999999997]
["516ERRH","Eye Rod - Rigging 5/16\" Hole 5/16-24 RH ",11.07,46,7.7489999999999997]
["516ERLH-P","Eye Rod - Rigging 5/16\" Hole 5/16-24 LH-NPH ",11.07,46,7.7489999999999997]
["516ERLH","Eye Rod - Rigging 5/16\" Hole 5/16-24 LH ",11.07,46,7.7489999999999997]
["38ERRH-P","Eye Rod - Rigging 3/8\" Hole 3/8-24 RH-NPH   ",14.32,46,10.023999999999999]
["38ERRH","Eye Rod - Rigging 3/8\" Hole 3/8-24 RH   ",14.32,46,10.023999999999999]
["38ERLH-P","Eye Rod - Rigging 3/8\" Hole 3/8-24 LH-NPH   ",14.32,46,10.023999999999999]
["38ERLH","Eye Rod - Rigging 3/8\" Hole 3/8-24 LH   ",14.32,46,10.023999999999999]
["12ERRH-P","Eye Rod - Rigging 1/2\" Hole 1/2-20 RH-NPH   ",24.15,46,16.904999999999998]
["12ERRH","Eye Rod - Rigging 1/2\" Hole 1/2-20 RH   ",24.15,46,16.904999999999998]
["12ERLH-P","Eye Rod - Rigging 1/2\" Hole 1/2-20 LH-NPH   ",24.15,46,16.904999999999998]
["12ERLH","Eye Rod - Rigging 1/2\" Hole 1/2-20 LH   ",24.15,46,16.904999999999998]
["58ERRH-P","Eye Rod - Rigging 5/8\" Hole  5/8-18 RH-NPH  ",42.14,46,29.497999999999998]
["58ERRH","Eye Rod - Rigging 5/8\" Hole  5/8-18 RH  ",42.14,46,29.497999999999998]
["58ERLH-P","Eye Rod - Rigging 5/8\" Hole 5/8-18 LH-NPH   ",42.14,46,29.497999999999998]
["58ERLH","Eye Rod - Rigging 5/8\" Hole 5/8-18 LH   ",42.14,46,29.497999999999998]
["34ERRH-P","Eye Rod - Rigging 3/4\" Hole 3/4-16 RH-NPH   ",61.89,46,43.323]
["34ERRH","Eye Rod - Rigging 3/4\" Hole 3/4-16 RH   ",61.89,46,43.323]
["34ERLH-P","Eye Rod - Rigging 3/4\" Hole 3/4-16 LH-NPH   ",61.89,46,43.323]
["34ERLH","Eye Rod - Rigging 3/4\" Hole 3/4-16 LH   ",61.89,46,43.323]
["78ERRH-P","Eye Rod - Rigging 7/8\" Hole 7/8-14 RH-NPH   ",98.08,46,68.655999999999992]
["78ERRH","Eye Rod - Rigging 7/8\" Hole 7/8-14 RH   ",98.08,46,68.655999999999992]
["78ERLH-P","Eye Rod - Rigging 7/8\" Hole 7/8-14 LH-NPH   ",98.08,46,68.655999999999992]
["78ERLH","Eye Rod - Rigging 7/8\" Hole 7/8-14 LH   ",98.08,46,68.655999999999992]
["1ERRH-P","Eye Rod - Rigging 1.0\" Hole 1-12 RH-NPH   ",156.32,46,109.42399999999999]
["1ERRH","Eye Rod - Rigging 1.0\" Hole 1-12 RH   ",156.32,46,109.42399999999999]
["1ERLH-P","Eye Rod - Rigging 1.0\" Hole 1-12 LH-NPH  ",156.32,46,109.42399999999999]
["1ERLH","Eye Rod - Rigging 1.0\" Hole 1-12 LH   ",156.32,46,109.42399999999999]
[null,null,null,null,""]
["Replacement Threaded Eye Rods - Lifeline",null,null,null,""]
["14LLERLH","Eye Rod - Lifeline 1/4\" Eye 1/4-28 LH   ",20.100000000000001,46,14.07]
["516LLERLH","Eye Rod - Lifeline 3/8\" Eye 5/16-24 LH  ",21.8,46,15.26]
["38LLERLH","Eye Rod - Lifeline 3/8\" Eye 3/8-24 LH   ",24.75,46,17.324999999999999]
[null,null,null,null,""]
["Replacement Turnbuckle Bodies - Forged Bronze",null,null,null,""]
["14FB","Turnbuckle Body CB Open 1/4-28 X 4 1/2\" ",20.11,47,14.076999999999998]
["14FBB","Turnbuckle Body FB Open 1/4-28 X 4 1/2\" ",18.47,47,12.928999999999998]
["516FB","Turnbuckle Body CB Open 5/16-24 X 5\"    ",27.54,47,19.277999999999999]
["516FBB","Turnbuckle Body FB Open 5/16-24 X 5\"    ",25.91,47,18.137]
["38FB","Turnbuckle Body CB Open 3/8-24 X 5 1/2\" ",33.47,47,23.428999999999998]
["38FBB","Turnbuckle Body FB Open 3/8-24 X 5 1/2\" ",31.84,47,22.288]
["12FB","Turnbuckle Body CB Open 1/2-20 X 6 1/2\" ",48.14,47,{"$f":"IF(ISBLANK(C1865),\"\",C1865*$E$5)","v":33.698}]
["12FBB","Turnbuckle Body FB Open 1/2-20 X 6 1/2\" ",44.9,47,31.429999999999996]
["58FB","Turnbuckle Body CB Open 5/8-18 X 8 1/4\" ",74.430000000000007,47,52.100999999999999]
["58FBB","Turnbuckle Body FB Open 5/8-18 X 8 1/4\" ",71.19,47,49.832999999999998]
["34FB","Turnbuckle Body CB Open 3/4-16 X 9 3/4\" ",144.80000000000001,47,101.36]
["34FBB","Turnbuckle Body FB Open 3/4-16 X 9 3/4\" ",139.91999999999999,47,97.943999999999988]
["78FB","Turnbuckle Body CB Open 7/8-14 x 12 1/2\"",508.09,47,355.66299999999995]
["1FB","Turnbuckle Body CB Open 1.0-12 x 13 5/8\"",764.15,47,534.90499999999997]
[null,null,null,null,""]
["Replacement Turnbuckle Bodies - Closed Tubular Stainless",null,null,null,""]
["10TB2","Turnbuckle Body SS Closed 10-32 X 2 1/4\"",10.72,47,7.5039999999999996]
["10TB","Turnbuckle Body SS Closed 10-32 X 3 1/2\"",10.72,47,7.5039999999999996]
["14TB2","Turnbuckle Body SS Closed 1/4-28 X 2 3/4",12.69,47,8.8829999999999991]
["14TB","Turnbuckle Body SS Closed 1/4-28 X 4 1/2",12.69,47,8.8829999999999991]
["516TB","Turnbuckle Body SS Closed 5/16-24 X 5\"  ",17.13,47,11.990999999999998]
["38TB","Turnbuckle Body SS Closed 3/8-24 X 5 1/2",24.28,47,16.995999999999999]
["12TB","Turnbuckle Body SS Closed 1/2-20 X 6 1/2",49.68,47,34.775999999999996]
["58TB","Turnbuckle Body SS Closed 5/8-18 X 8 1/4",105.18,47,73.626000000000005]
["34TB","Turnbuckle Body SS Closed 3/4-16 X 9 3/4",273.32,47,191.32399999999998]
["78TB","Turnbuckle Body SS Closed 7/8 X 10 13/16",292.23,47,204.56100000000001]
["1TB","Turnbuckle Body SS Closed 1.0 X 13\"",570.78,47,399.54599999999994]
[null,null,null,null,""]
["Replacement Clevis Pins",null,null,null,""]
["SB1","Clevis Pin 3/16\" Dia. X 9/32\" Grip      ",1.1100000000000001,48,0.77700000000000002]
["SB2","Clevis Pin 3/16\" Dia. X 13/32\" Grip     ",1.1100000000000001,48,0.77700000000000002]
["SB3","Clevis Pin 3/16\" Dia. X 9/16\" Grip      ",1.1100000000000001,48,0.77700000000000002]
["SB4","Clevis Pin 3/16\" Dia. X 3/4\" Grip       ",1.26,48,0.8819999999999999]
["SB5","Clevis Pin 3/16\" Dia. X 15/16\" Grip     ",1.44,48,1.008]
["SB6","Clevis Pin 1/4\" Dia. X 1/2\" Grip        ",1.26,48,0.8819999999999999]
["SB7","Clevis Pin 1/4\" Dia. X 9/16\" Grip       ",1.44,48,1.008]
["CP1458","Clevis Pin 1/4\" Dia. X 5/8\" Grip        ",1.48,48,1.036]
["SB8","Clevis Pin 1/4\" Dia. X 3/4\" Grip        ",1.56,48,1.0919999999999999]
["CP1478","Clevis Pin 1/4\" Dia. X 7/8\" Grip        ",1.68,48,1.1759999999999999]
["CP141","Clevis Pin 1/4\" Dia. X 1\" Grip          ",1.76,48,1.232]
["CP14118","Clevis Pin 1/4\" Dia. X 1 1/8\" Grip      ",1.79,48,1.2529999999999999]
["CP14114","Clevis Pin 1/4\" Dia. X 1 1/4\" Grip      ",1.84,48,1.288]
["CP14112","Clevis Pin 1/4\" Dia. X 1 1/2\" Grip      ",2,48,1.4]
["516CP","Clevis Pin 5/16\" Dia. X 9/16\" Grip      ",2.96,48,2.0720000000000001]
["BB2","Clevis Pin 5/16\" Dia. X 11/16\" Grip     ",2.14,48,1.498]
["CP5161","Clevis Pin 5/16\" Dia. X 1\" Grip         ",2.33,48,1.631]
["CP516118","Clevis Pin 5/16\" Dia. X 1 1/8\" Grip     ",2.41,48,1.6870000000000001]
["CP516114","Clevis Pin 5/16\" Dia. X 1 1/4\" Grip     ",2.5299999999999998,48,1.7709999999999997]
["CP516112","Clevis Pin 5/16\" Dia. X 1 1/2\" Grip     ",2.72,48,1.9039999999999999]
["38CP","Clevis Pin 3/8\" Dia. X 11/16\" Grip      ",2.78,48,1.9459999999999997]
["BB3","Clevis Pin 3/8\" Dia. X 13/16\" Grip      ",2.84,48,1.9879999999999998]
["CP381","Clevis Pin 3/8\" Dia. X 1\" Grip          ",4.62,48,3.234]
["CP38114","Clevis Pin 3/8\" Dia. X 1 1/4\" Grip      ",4.83,48,3.3809999999999998]
["CP38112","Clevis Pin 3/8\" Dia. X 1 1/2\" Grip      ",5.08,48,3.5559999999999996]
["CP71634","Clevis Pin 7/16\" Dia. X 3/4\" Grip       ",4.83,48,3.3809999999999998]
["BB4","Clevis Pin 7/16\" Dia. X 29/32\" Grip     ",4.42,48,3.0939999999999999]
["CP7161","Clevis Pin 7/16\" Dia. X 1\" Grip         ",4.9000000000000004,48,3.43]
["12CP","Clevis Pin 1/2\" Dia. X 7/8\" Grip        ",5.05,48,3.5349999999999997]
["BB5","Clevis Pin 1/2\" Dia. X 1\" Grip          ",5.15,48,3.605]
["CP12112","Clevis Pin 1/2\" Dia. X 1 1/2\" Grip      ",6.86,48,4.8019999999999996]
["58CP","Clevis Pin 5/8\" Dia. X 1 1/8\" Grip      ",8.56,48,5.992]
["BB6","Clevis Pin 5/8\" Dia. X 1 1/4\" Grip      ",8.69,48,6.0829999999999993]
["34CP","Clevis Pin 3/4\" Dia. X 1 5/16\" Grip     ",19.87,48,13.909000000000001]
["BB7","Clevis Pin 3/4\" Dia. X 1 9/16\" Grip     ",19.87,48,13.909000000000001]
["BB8","Clevis Pin 7/8\" Dia. X 1 13/16\" Grip    ",29.41,48,20.587]
["78CP","Clevis Pin 7/8\" Dia. 1-3/4\" Grip      ",29.53,48,20.670999999999999]
["1CP","Clevis Pin 1.0\" Dia. 1-7/8\" Grip      ",34.86,48,24.401999999999997]
[null,null,null,null,""]
["Replacement Cotter Pins",null,null,null,""]
["11612C","Cotter Pin 1/16\" Dia X 1/2 Grip 100 PK  ",9.98,48,6.9859999999999998]
["116112C","Cotter Pin 1/16\" Dia X 1 1/2 Grip 100 PK",9.98,48,{"$f":"IF(ISBLANK(C1929),\"\",C1929*$E$5)","v":6.9859999999999998}]
["33234C","Cotter Pin 3/32\" Dia X 3/4 Grip 100 PK  ",9.98,48,6.9859999999999998]
["332114C","Cotter Pin 3/32\" Dia X 1 1/4 Grip 100 PK",9.98,48,6.9859999999999998]
["181C","Cotter Pin 1/8\" Dia X 1\" Grip 100 PK    ",17.899999999999999,48,12.529999999999998]
["18212C","Cotter Pin 1/8\" Dia X 2 1/2 Grip 100 PK ",24.77,48,17.338999999999999]
["183C","Cotter Pin 1/8\" Dia X 3\" Grip 100 PK    ",32.340000000000003,48,22.638000000000002]
["532114C","Cotter Pin 5/32\" Dia X 1 1/4 Grip 100 PK",22.71,48,15.897]
["316112C","Cotter Pin 3/16\" Dia X 1 1/2 Grip 100 PK",36.130000000000003,48,25.291]
[null,null,null,null,""]
["Replacement Circular Ring Pins",null,null,null,""]
["CR1","Circular Ring Pin 3/4\" Ring SS - 100 PK ",12.97,48,9.0790000000000006]
["CR2","Circular Ring Pin 5/8\" Ring SS - 100 PK ",12.97,48,9.0790000000000006]
["CR3","Circular Ring Pin 7/16\" Ring SS - 100 PK",12.97,48,9.0790000000000006]
["CR4","Circular Ring Pin 7/8\" Ring SS - 100 PK ",19.46,48,13.622]
[null,null,null,null,""]
["Replacement Adjuster Nuts",null,null,null,""]
["10SAN","Adjuster Nut 10-32 RH                   ",11.35,48,7.9449999999999994]
["14SAN","Adjuster Nut 1/4-28 RH                  ",11.35,48,7.9449999999999994]
["14ALLARN","Adjuster Nut 1/4-28 LH                  ",11.35,48,7.9449999999999994]
[null,null,null,null,""]
["Replacement Rigging Pins",null,null,null,""]
["RP1434","Rigging Pin 1/4\" Dia. X 3/4\" Grip       ",2.04,49,1.4279999999999999]
["RP1478","Rigging Pin 1/4\" Dia. X 7/8\" Grip       ",2.37,49,1.659]
["RP141","Rigging Pin 1/4\" Dia. X 1\" Grip         ",3.03,49,2.1209999999999996]
["RP14118","Rigging Pin 1/4\" Dia. X 1 1/8\" Grip     ",3.31,49,2.3169999999999997]
["RP14114","Rigging Pin 1/4\" Dia. X 1 1/4\" Grip     ",3.37,49,2.359]
["RP14112","Rigging Pin 1/4\" Dia. X 1 1/2\" Grip     ",3.43,49,2.4009999999999998]
["RP14134","Rigging Pin 1/4\" Dia. X 1 3/4\" Grip     ",3.52,49,2.464]
["RP142","Rigging Pin 1/4\" Dia. X 2\" Grip         ",3.65,49,2.5549999999999997]
["RP14214","Rigging Pin 1/4\" Dia. X 2 1/4\" Grip     ",3.95,49,2.7650000000000001]
["RP14212","Rigging Pin 1/4\" Dia. X 2 1/2\" Grip     ",4.2699999999999996,49,2.9889999999999994]
["RP14312","Rigging Pin 1/4\" Dia. X 3 1/2\" Grip     ",5.0599999999999996,49,3.5419999999999994]
["RP51634","Rigging Pin 5/16\" Dia. X 3/4\" Grip      ",2.68,49,1.8759999999999999]
["RP51678","Rigging Pin 5/16\" Dia. X 7/8\" Grip      ",2.82,49,1.9739999999999998]
["RP5161","Rigging Pin 5/16\" Dia. X 1\" Grip        ",3.03,49,2.1209999999999996]
["RP516118","Rigging Pin 5/16\" Dia. X 1 1/8\" Grip    ",3.21,49,2.2469999999999999]
["RP516114","Rigging Pin 5/16\" Dia. X 1 1/4\" Grip    ",3.31,49,2.3169999999999997]
["RP516112","Rigging Pin 5/16\" Dia. X 1 1/2\" Grip    ",3.65,49,2.5549999999999997]
["RP516134","Rigging Pin 5/16\" Dia. X 1 3/4\" Grip    ",3.79,49,2.653]
["RP5162","Rigging Pin 5/16\" Dia. X 2\" Grip        ",3.95,49,2.7650000000000001]
["RP516214","Rigging Pin 5/16\" Dia. X 2 1/4\" Grip    ",4.8499999999999996,49,3.3949999999999996]
["RP516212","Rigging Pin 5/16\" Dia. X 2 1/2\" Grip    ",4.24,49,2.968]
["RP516312","Rigging Pin 5/16\" Dia. X 3 1/2\" Grip    ",4.2699999999999996,49,2.9889999999999994]
["RP3834","Rigging Pin 3/8\" Dia. X 3/4\" Grip       ",3.65,49,2.5549999999999997]
["RP3878","Rigging Pin 3/8\" Dia. X 7/8\" Grip       ",3.67,49,2.569]
["RP381","Rigging Pin 3/8\" Dia. X 1\" Grip         ",3.72,49,2.6040000000000001]
["RP38118","Rigging Pin 3/8\" Dia. X 1 1/8\" Grip     ",3.93,49,2.7509999999999999]
["RP38114","Rigging Pin 3/8\" Dia. X 1 1/4\" Grip     ",4.08,49,2.8559999999999999]
["RP38112","Rigging Pin 3/8\" Dia. X 1 1/2\" Grip     ",4.38,49,3.0659999999999998]
["RP38134","Rigging Pin 3/8\" Dia. X 1 3/4\" Grip     ",4.6900000000000004,49,3.2829999999999999]
["RP382","Rigging Pin 3/8\" Dia. X 2\" Grip         ",5.01,49,3.5069999999999997]
["RP38214","Rigging Pin 3/8\" Dia. X 2 1/4\" Grip     ",5.22,49,3.6539999999999995]
["RP38212","Rigging Pin 3/8\" Dia. X 2 1/2\" Grip     ",5.31,49,3.7169999999999996]
["RP38312","Rigging Pin 3/8\" Dia. X 3 1/2\" Grip     ",5.65,49,3.9550000000000001]
["RP71634","Rigging Pin 7/16\" Dia. X 3/4\" Grip      ",6.19,49,4.3330000000000002]
["RP71678","Rigging Pin 7/16\" Dia. X 7/8\" Grip      ",6.4,49,4.4799999999999995]
["RP7161","Rigging Pin 7/16\" Dia. X 1\" Grip        ",6.43,49,4.5009999999999994]
["RP716118","Rigging Pin 7/16\" Dia. X 1 1/8\" Grip    ",6.61,49,4.6269999999999998]
["RP716114","Rigging Pin 7/16\" Dia. X 1 1/4\" Grip    ",6.76,49,4.7319999999999993]
["RP716112","Rigging Pin 7/16\" Dia. X 1 1/2\" Grip    ",7.07,49,4.9489999999999998]
["RP716134","Rigging Pin 7/16\" Dia. X 1 3/4\" Grip    ",7.7,49,5.39]
["RP7162","Rigging Pin 7/16\" Dia. X 2\" Grip        ",8.0399999999999991,49,5.6279999999999992]
["RP716214","Rigging Pin 7/16\" Dia. X 2 1/4\" Grip    ",8.16,49,5.7119999999999997]
["RP716212","Rigging Pin 7/16\" Dia. X 2 1/2\" Grip    ",8.2799999999999994,49,5.7959999999999994]
["RP716312","Rigging Pin 7/16\" Dia. X 3 1/2\" Grip    ",8.66,49,{"$f":"IF(ISBLANK(C1993),\"\",C1993*$E$5)","v":6.0619999999999994}]
["RP121","Rigging Pin 1/2\" Dia. X 1\" Grip         ",9.41,49,6.5869999999999997]
["RP12118","Rigging Pin 1/2\" Dia. X 1 1/8\" Grip     ",9.5500000000000007,49,6.6850000000000005]
["RP12114","Rigging Pin 1/2\" Dia. X 1 1/4\" Grip     ",9.6199999999999992,49,6.7339999999999991]
["RP12112","Rigging Pin 1/2\" Dia. X 1 1/2\" Grip     ",9.93,49,6.9509999999999996]
["RP12134","Rigging Pin 1/2\" Dia. X 1 3/4\" Grip     ",10.35,49,7.2449999999999992]
["RP122","Rigging Pin 1/2\" Dia. X 2\" Grip         ",10.66,49,7.4619999999999997]
["RP12214","Rigging Pin 1/2\" Dia. X 2 1/4\" Grip     ",10.89,49,7.6230000000000002]
["RP12212","Rigging Pin 1/2\" Dia. X 2 1/2\" Grip     ",11.19,49,7.8329999999999993]
["RP12312","Rigging Pin 1/2\" Dia. X 3 1/2\" Grip     ",11.53,49,8.0709999999999997]
["RP12612","Rigging Pin 1/2\" Dia. X 6 1/2\" Grip     ",13.04,49,9.1279999999999983]
["RP581","Rigging Pin 5/8\" Dia. X 1\" Grip         ",12.81,49,8.9670000000000005]
["RP58118","Rigging Pin 5/8\" Dia. X 1 1/8\" Grip     ",12.96,49,9.0719999999999992]
["RP58114","Rigging Pin 5/8\" Dia. X 1 1/4\" Grip     ",13.66,49,9.5619999999999994]
["RP58112","Rigging Pin 5/8\" Dia. X 1 1/2\" Grip     ",13.92,49,9.7439999999999998]
["RP58134","Rigging Pin 5/8\" Dia. X 1 3/4\" Grip     ",14.02,49,9.8139999999999983]
["RP582","Rigging Pin 5/8\" Dia. X 2\" Grip         ",14.32,49,10.023999999999999]
["RP58214","Rigging Pin 5/8\" Dia. X 2 1/4\" Grip     ",14.74,49,10.318]
["RP58212","Rigging Pin 5/8\" Dia. X 2 1/2\" Grip     ",15.1,49,10.569999999999999]
["RP58312","Rigging Pin 5/8\" Dia. X 3 1/2\" Grip     ",15.9,49,11.129999999999999]
["RP58612","Rigging Pin 5/8\" Dia. X 6 1/2\" Grip     ",19.07,49,13.349]
["RP341","Rigging Pin 3/4\" Dia. X 1\" Grip         ",16.28,49,11.396000000000001]
["RP34114","Rigging Pin 3/4\" Dia. X 1 1/4\" Grip     ",18.100000000000001,49,12.67]
["RP34112","Rigging Pin 3/4\" Dia. X 1 1/2\" Grip     ",18.68,49,13.075999999999999]
["RP342","Rigging Pin 3/4\" Dia. X 2\" Grip         ",31.8,49,22.259999999999998]
["RP34214","Rigging Pin 3/4\" Dia. X 2 1/4\" Grip     ",23.61,49,16.526999999999997]
["RP34212","Rigging Pin 3/4\" Dia. X 2 1/2\" Grip     ",38.17,49,26.719000000000001]
["RP34312","Rigging Pin 3/4\" Dia. X 3 1/2\" Grip     ",28.84,49,20.187999999999999]
[null,null,null,null,""]
["Replacement Hex Nuts for Turnbuckles",null,null,null,""]
["10LNR","Hex Nut, Stainless Steel - 10-32 RH     ",0.33,49,0.23099999999999998]
["10LNL","Hex Nut, Stainless Steel - 10-32 LH     ",0.64,49,0.44799999999999995]
["14LNR","Hex Nut, Stainless Steel - 1/4-28 RH    ",0.33,49,0.23099999999999998]
["14LNL","Hex Nut, Stainless Steel - 1/4-28 LH    ",0.66,49,0.46199999999999997]
["516LNR","Hex Nut, Stainless Steel - 5/16-24 RH   ",0.37,49,0.25900000000000001]
["516LNL","Hex Nut, Stainless Steel - 5/16-24 LH   ",0.76,49,0.53199999999999992]
["38LNR","Hex Nut, Stainless Steel - 3/8-24 RH    ",0.42,49,0.29399999999999998]
["38LNL","Hex Nut, Stainless Steel - 3/8-24 LH    ",0.76,49,0.53199999999999992]
["12LNR","Hex Nut, Stainless Steel - 1/2-20 RH    ",2.5099999999999998,49,1.7569999999999997]
["12LNL","Hex Nut, Stainless Steel - 1/2-20 LH    ",3.56,49,2.492]
["58LNR","Hex Nut, Stainless Steel - 5/8-18 RH    ",3.22,49,2.254]
["58LNL","Hex Nut, Stainless Steel - 5/8-18 LH    ",4.88,49,3.4159999999999999]
["34LNR","Hex Nut, Stainless Steel - 3/4-16 RH                     ",4.17,49,2.9189999999999996]
["34LNL","Hex Nut, Stainless Steel - 3/4-16 LH                     ",6.48,49,4.5359999999999996]
["78LNR","Hex Nut, Stainless Steel - 7/8-14 RH                     ",12.04,49,8.427999999999999]
["78LNL","Hex Nut, Stainless Steel - 7/8-14 LH                     ",12.04,49,8.427999999999999]
["1LNR","Hex Nut, Stainless Steel - 1.0-12 RH                     ",17.2,49,12.04]
["1LNL","Hex Nut, Stainless Steel - 1.0-12 LH                     ",17.2,49,12.04]
[null,null,null,null,""]
["Replacement Rigging Studs (Machine Swage) - Turnbuckles - Imperial Wire Sizes",null,null,null,""]
["10SE116RH","Stud Rigging 1/16\" Wire 10-32 X 1-3/4 RH",8.49,50,5.9429999999999996]
["10SE116LH","Stud Rigging 1/16\" Wire 10-32 X 1-3/4 LH",8.49,50,5.9429999999999996]
["10SE332RH","Stud Rigging 3/32\" Wire 10-32 X 1-3/4 RH",8.49,50,5.9429999999999996]
["10SE332LH","Stud Rigging 3/32\" Wire 10-32 X 1-3/4 LH",8.49,50,5.9429999999999996]
["14SE332RH","Stud Rigging 3/32\" Wire 1/4-28 X 2-1/4 RH",8.6199999999999992,50,6.0339999999999989]
["14SE332LH","Stud Rigging 3/32\" Wire 1/4-28 X 2-1/4 LH",8.6199999999999992,50,6.0339999999999989]
["10SE18RH","Stud Rigging 1/8\" Wire 10-32 X 1-3/4 RH",10.85,50,7.5949999999999989]
["10SE18LH","Stud Rigging 1/8\" Wire 10-32 X 1-3/4 LH",10.85,50,7.5949999999999989]
["14SE18RH","Stud Rigging 1/8\" Wire 1/4-28 X 2 1/4 RH",8.64,50,6.048]
["14SE18LH","Stud Rigging 1/8\" Wire 1/4-28 X 2 1/4 LH",8.64,50,6.048]
["14SE532RH","Stud Rigging 5/32\" Wire 1/4-28 X 2 1/4 RH",11.58,50,8.1059999999999999]
["14SE532LH","Stud Rigging 5/32\" Wire 1/4-28 X 2 1/4 LH",11.58,50,8.1059999999999999]
["516SE532RH","Stud Rigging 5/32\" Wire 5/16-24 X 2 1/2RH",11.74,50,8.218]
["516SE532LH","Stud Rigging 5/32\" Wire 5/16-24 X 2 5/8LH",11.74,50,8.218]
["516SE316RH","Stud Rigging 3/16\" Wire 5/16-24 X 2 1/2RH",13.21,50,{"$f":"IF(ISBLANK(C2057),\"\",C2057*$E$5)","v":9.2469999999999999}]
["516SE316LH","Stud Rigging 3/16\" Wire 5/16-24 X 2 1/2LH",13.21,50,9.2469999999999999]
["38SE316RH","Stud Rigging 3/16\" Wire 3/8-24 X 2 7/8 RH",12.74,50,8.9179999999999993]
["38SE316LH","Stud Rigging 3/16\" Wire 3/8-24 X 2 7/8 LH",12.74,50,8.9179999999999993]
["38SE732RH","Stud Rigging 7/32\" Wire 3/8-24 X 2 7/8 RH",18.920000000000002,50,13.244]
["38SE732LH","Stud Rigging 7/32\" Wire 3/8-24 X 2 7/8 LH",18.920000000000002,50,13.244]
["716SE732RH","Stud Rigging 7/32\" Wire 7/16-20 X 2 7/8RH",19.2,50,13.44]
["716SE732LH","Stud Rigging 7/32\" Wire 7/16-20 X 2 7/8LH",19.2,50,13.44]
["38SE14RH","Stud Rigging 1/4\" Wire 3/8-24 X 2 7/8 RH",19.440000000000001,50,13.608000000000001]
["38SE14LH","Stud Rigging 1/4\" Wire 3/8-24 X 2 7/8 LH",19.440000000000001,50,13.608000000000001]
["716SE14RH","Stud Rigging 1/4\" Wire 7/16-20 X 3 1/4 RH",20.49,50,14.342999999999998]
["716SE14LH","Stud Rigging 1/4\" Wire 7/16-20 X 3 1/4 LH",20.49,50,14.342999999999998]
["12SE14RH","Stud Rigging 1/4\" Wire 1/2-20 X 3 1/4 RH",20.49,50,14.342999999999998]
["12SE14LH","Stud Rigging 1/4\" Wire 1/2-20 X 3 1/4 LH",20.49,50,14.342999999999998]
["716SE932RH","Stud Rigging 9/32\" Wire 7/16-20 X 3 1/4RH",28.11,50,19.677]
["716SE932LH","Stud Rigging 9/32\" Wire 7/16-20 X 3 1/4LH",28.11,50,19.677]
["12SE932RH","Stud Rigging 9/32\" Wire 1/2-20 X 3 1/4 RH",28.11,50,19.677]
["12SE932LH","Stud Rigging 9/32\" Wire 1/2-20 X 3 1/4 LH",28.11,50,19.677]
["12SE516RH","Stud Rigging 5/16\" Wire 1/2-20 X 3 1/4 RH",33.299999999999997,50,23.309999999999995]
["12SE516LH","Stud Rigging 5/16\" Wire 1/2-20 X 3 1/4 LH",33.299999999999997,50,23.309999999999995]
["58SE516RH","Stud Rigging 5/16\" Wire 5/8-18 X 4 RH   ",35.39,50,24.773]
["58SE516LH","Stud Rigging 5/16\" Wire 5/8-18 X 4 LH   ",35.39,50,24.773]
["916SE38RH","Stud Rigging 3/8\" Wire 9/16-18 X 4 RH   ",44.21,50,30.946999999999999]
["916SE38LH","Stud Rigging 3/8\" Wire 9/16-18 X 4 LH   ",44.21,50,30.946999999999999]
["58SE38RH","Stud Rigging 3/8\" Wire 5/8-18 X 4 RH    ",44.21,50,30.946999999999999]
["58SE38LH","Stud Rigging 3/8\" Wire 5/8-18 X 4 LH    ",44.21,50,30.946999999999999]
["34SE716RH","Stud Rigging 7/16\" Wire 3/4-16 X 5 RH   ",67.23,50,47.061]
["34SE716LH","Stud Rigging 7/16\" Wire 3/4-16 X 5 LH   ",67.23,50,47.061]
["34SE12RH","Stud Rigging 1/2\" Wire 3/4-16 X 5 RH",85.63,50,59.940999999999995]
["34SE12LH","Stud Rigging 1/2\" Wire 3/4-16 X 5 LH    ",85.63,50,59.940999999999995]
["78SE12RH","Stud Rigging 1/2\" Wire 7/8-14 X 6 RH    ",141.33000000000001,50,98.930999999999997]
["78SE12LH","Stud Rigging 1/2\" Wire 7/8-14 X 6 LH    ",141.33000000000001,50,98.930999999999997]
["78SE916RH","Stud Rigging 9/16\" Wire 7/8-14 X 6 RH   ",164.29,50,115.00299999999999]
["78SE916LH","Stud Rigging 9/16\" Wire 7/8-14 X 6 LH   ",164.29,50,115.00299999999999]
["1SE916RH","Stud Rigging 9/16\" Wire 1-12 X 6-7/8 RH",196.78,50,137.74599999999998]
["1SE916LH","Stud Rigging 9/16\" Wire 1-12 X 6-7/8 LH",196.78,50,137.74599999999998]
["1SE58RH","Stud Rigging 5/8\" Wire 1-12 X 6-7/8 RH",211.4,50,147.97999999999999]
["1SE58LH","Stud Rigging 5/8\" Wire 1-12 X 6-7/8 LH",211.4,50,147.97999999999999]
[null,null,"",null,{"$error":"#VALUE!"}]
["Replacement Rigging Studs (Machine Swage)- Rigging Adjusters - Imperial Wire Size",null,"",null,{"$error":"#VALUE!"}]
["10ASE116RH","Stud Rigging 1/16\" Wire 10-32 X 3 RH     ",11.3,50,7.91]
["10ASE332RH","Stud Rigging 3/32\" Wire 10-32 X 3 RH     ",10.8,50,7.56]
["10ASE18RH","Stud Rigging 1/8\" Wire 10-32 X 3 RH     ",11.29,50,7.9029999999999987]
["14ASE18RH","Stud Rigging 1/8\" Wire 1/4-28 X 3-1/2 RH",10.97,50,7.6790000000000003]
["14ASE532RH","Stud Rigging 5/32\" Wire 1/4-28 X 3-1/2 RH",12.69,50,8.8829999999999991]
[null,null,null,null,""]
["Replacement Rigging Studs (Machine Swage) - Turnbuckles - Metric Wire Sizes",null,null,null,""]
["14SEM03RH","Stud Rigging 3mm Wire 1/4-28 X 2 1/4 RH ",8.64,51,6.048]
["14SEM04RH","Stud Rigging 4mm Wire 1/4-28 X 2 1/4 RH",11.58,51,8.1059999999999999]
["516SEM04RH","Stud Rigging 4mm Wire 5/16-24 X 2 1/2 RH ",13.22,51,9.2539999999999996]
["516SEM05RH","Stud Rigging 5mm Wire 5/16-24 X 2 1/2 RH ",13.21,51,9.2469999999999999]
["38SEM05RH","Stud Rigging 5mm Wire 3/8-24 X 2 7/8 RH  ",12.74,51,8.9179999999999993]
["38SEM06RH","Stud Rigging 6mm Wire 3/8-24 X 2 7/8 RH ",19.440000000000001,51,13.608000000000001]
["716SEM06RH","Stud Rigging 6mm Wire 7/16-20 X 3 1/4 RH",20.49,51,14.342999999999998]
["12SEM06RH","Stud Rigging 6mm Wire 1/2-20 X 3 1/4 RH  ",20.49,51,14.342999999999998]
["716SEM07RH","Stud Rigging 7mm Wire 7/16-20 X 3 1/4RH",28.11,51,19.677]
["12SEM07RH","Stud Rigging 7mm Wire 1/2-20 X 3 1/4 RH",28.11,51,19.677]
["12SEM08RH","Stud Rigging 8mm Wire 1/2-20 X 3 1/4 RH",33.299999999999997,51,23.309999999999995]
["58SEM08RH","Stud Rigging 8mm Wire 5/8-18 X 4 RH    ",35.39,51,24.773]
["916SEM10RH","Stud Rigging 10mm Wire 9/16-18 X 4 RH    ",44.21,51,30.946999999999999]
["58SEM10RH","Stud Rigging 10mm Wire 5/8-18 X 4 RH     ",44.21,51,30.946999999999999]
["34SEM11RH","Stud Rigging 11mm Wire 3/4-16 X 5 RH    ",67.23,51,47.061]
["34SEM12RH","Stud Rigging 12mm Wire 3/4-16 X 5 RH     ",85.63,51,59.940999999999995]
["78SEM12RH","Stud Rigging 12mm Wire 7/8-14 X 6 RH     ",141.33000000000001,51,98.930999999999997]
["78SEM14RH","Stud Rigging 14mm Wire 7/8-14 X 6 RH    ",164.29,51,{"$f":"IF(ISBLANK(C2121),\"\",C2121*$E$5)","v":115.00299999999999}]
["1SEM14RH","Stud Rigging 14mm Wire 1-12 X 6 7/8 RH",196.78,51,137.74599999999998]
["1SEM16RH","Stud Rigging 16mm Wire 1-12 X 6 7/8\" RH",211.4,51,147.97999999999999]
[null,null,null,null,""]
["Replacement Rigging Studs (Machine Swage)- Rigging Adjusters - Metric Wire Size",null,null,null,""]
["10ASEM03RH","Stud Rigging 3mm Wire 10-32 X 3 RH    ",11.28,51,7.895999999999999]
["14ASEM03RH","Stud Rigging 3mm Wire 1/4-28 X 3-1/2 RH",10.97,51,7.6790000000000003]
["14ASEM04RH","Stud Rigging 4mm Wire 1/4-28 X 3-1/2 RH",12.69,51,8.8829999999999991]
[null,null,null,null,""]
["Replacement Lifeline Studs - (Machine Swage) Turnbuckles - Imperial Wire Sizes",null,null,null,""]
["10LL18RH","Lifeline Stud 1/8\" Wire-10-32 x 1 3/4 RH",7.6,52,5.3199999999999994]
["10LL18LH","Lifeline Stud 1/8\" Wire-10-32 x 1 3/4 LH",7.6,52,5.3199999999999994]
["14LL18RH","Lifeline Stud 1/8\" Wire-1/4-28 x2 1/4 RH",7.23,52,5.0609999999999999]
["14LL18LH","Lifeline Stud 1/8\" Wire-1/4-28 x2 1/4 LH",7.23,52,5.0609999999999999]
["14LL532RH","Lifeline Stud 5/32\" Wire-1/4-28x2 1/4 RH",8.32,52,5.8239999999999998]
["14LL532LH","Lifeline Stud 5/32\" Wire-1/4-28x2 1/4 LH",8.32,52,5.8239999999999998]
["516LL532RH","Lifeline Stud 5/32\" Wire-5/16-24x2 3/8RH",8.32,52,5.8239999999999998]
["516LL532LH","Lifeline Stud 5/32\" Wire-5/16-24x2 3/8LH",9.06,52,6.3419999999999996]
["14LL316RH","Lifeline Stud 3/16\" Wire-1/4-28 x2 1/4RH",9.52,52,6.6639999999999997]
["14LL316LH","Lifeline Stud 3/16\" Wire-1/4-28 x2 1/4LH",9.52,52,6.6639999999999997]
["516LL316RH","Lifeline Stud 3/16\" Wire-5/16-24x2 3/8RH",9.6300000000000008,52,6.7410000000000005]
["516LL316LH","Lifeline Stud 3/16\" Wire-5/16-24x2 3/8LH",9.6300000000000008,52,6.7410000000000005]
["516LL14RH","Lifeline Stud 1/4\" Wire-5/16-24x2 3/8 RH",17.16,52,12.011999999999999]
["516LL14LH","Lifeline Stud 1/4\" Wire-5/16-24x2 3/8 LH",17.16,52,12.011999999999999]
["38LL14RH","Lifeline Stud 1/4\" Wire-3/8-24x2 3/4 RH ",17.16,52,12.011999999999999]
["38LL14LH","Lifeline Stud 1/4\" Wire-3/8-24x2 3/4 LH ",17.16,52,12.011999999999999]
[null,null,null,null,""]
["Replacement Lifeline Studs (Machine Swage) - Pelican Hooks - Imperial Wire Sizes",null,null,null,""]
["14LLP18RH","Lifeline Stud 1/8\" Wire-1/4-28 x1 1/2 RH",7.13,52,4.9909999999999997]
["14LLP18LH","Lifeline Stud 1/8\" Wire-1/4-28 x1 1/2 LH",7.13,52,4.9909999999999997]
["14LLP532RH","Lifeline Stud 5/32\" Wire-1/4-28x1 1/2 RH",8.74,52,6.1179999999999994]
["14LLP532LH","Lifeline Stud 5/32\" Wire-1/4-28x1 1/2 LH",8.73,52,6.1109999999999998]
["14LLP316RH","Lifeline Stud 3/16\" Wire-1/4-28 x1 1/2RH",9.36,52,6.5519999999999996]
["14LLP316LH","Lifeline Stud 3/16\" Wire-1/4-28 x1 1/2LH",9.36,52,6.5519999999999996]
["516LL316RH","Lifeline Stud 3/16\" Wire-5/16-24x1 1/2RH",9.6300000000000008,52,6.7410000000000005]
["516LL316LH","Lifeline Stud 3/16\" Wire-5/16-24x1 1/2LH",9.6300000000000008,52,6.7410000000000005]
[null,null,null,null,""]
["Replacement Lifeline Studs - (Machine Swage) - Eyes - Imperial Wire Sizes",null,null,null,""]
["14LLE18RH","Lifeline Stud 1/8\" Wire-1/4-28 x 7/16 RH",7.07,52,4.9489999999999998]
["14LLE18LH","Lifeline Stud 1/8\" Wire-1/4-28 x 7/16 LH",7.07,52,4.9489999999999998]
["516LLE532RH","Lifeline Stud 5/32\" Wire-5/16-24x7/16 RH",8.14,52,5.6980000000000004]
["516LLE532LH","Lifeline Stud 5/32\" Wire-5/16-24x7/16 LH",8.14,52,5.6980000000000004]
["516LLE316RH","Lifeline Stud 3/16\" Wire-5/16-24x7/16 RH",8.8000000000000007,52,6.16]
["516LLE316LH","Lifeline Stud 3/16\" Wire-5/16-24x7/16 LH",8.8000000000000007,52,6.16]
["516LLE14RH","Lifeline Stud 1/4\" Wire-5/16-24x7/16 RH ",15.25,52,10.674999999999999]
["516LLE14LH","Lifeline Stud 1/4\" Wire-5/16-24x7/16 LH ",15.25,52,10.674999999999999]
["38LLE14RH","Lifeline Stud 1/4\" Wire-3/8-24x7/16 RH  ",15.25,52,10.674999999999999]
["38LLE14LH","Lifeline Stud 1/4\" Wire-3/8-24x7/16 LH  ",15.25,52,10.674999999999999]
[null,null,null,null,""]
["Replacement Lifeline Studs (Machine Swage) - Lifeline Adjusters - Imperial Wire Sizes",null,null,null,""]
["14ASLL18RH","Lifeline Stud 1/8\" Wire-1/4-28 x3 1/4 RH",7.95,52,5.5649999999999995]
["14ASLL532RH","Lifeline Stud 5/32\" Wire-1/4-28x3 1/4 RH",10.02,52,7.0139999999999993]
["14ASLL316RH","Lifeline Stud 3/16\" Wire-1/4-28 x3 1/2RH",10.95,52,7.6649999999999991]
[null,null,null,null,""]
["Replacement Lifeline Studs (Machine Swage)- Metric Studs - Imperial Wire Sizes",null,null,null,""]
["6MLL18RH","Lifeline Stud 1/8\" Wire-6mm x 2 1/4 RH  ",10.78,52,7.5459999999999994]
["6MLL18LH","Lifeline Stud 1/8\" Wire-6mm x 2 1/4 LH  ",10.78,52,7.5459999999999994]
["6MLL532RH","Lifeline Stud 5/32\" Wire-6mm x 2 1/4 RH ",13.44,52,9.4079999999999995]
["6MLL532LH","Lifeline Stud 5/32\" Wire-6mm x 2 1/4 LH ",13.44,52,9.4079999999999995]
["6MLL316RH","Lifeline Stud 3/16\" Wire-6mm x 2 1/4 RH ",13.11,52,9.1769999999999996]
["6MLL316LH","Lifeline Stud 3/16\" Wire-6mm x 2 1/4 LH ",13.11,52,9.1769999999999996]
["8MLL532RH","Lifeline Stud 5/32\" Wire-8mm x 2 3/8 RH ",13.11,52,9.1769999999999996]
["8MLL532LH","Lifeline Stud 5/32\" Wire-8mm x 2 3/8 LH ",13.11,52,9.1769999999999996]
["8MLL316RH","Lifeline Stud 3/16\" Wire-8mm x 2 3/8 RH ",13.4,52,9.379999999999999]
["8MLL316LH","Lifeline Stud 3/16\" Wire-8mm x 2 3/8 LH ",13.4,52,{"$f":"IF(ISBLANK(C2185),\"\",C2185*$E$5)","v":9.379999999999999}]
["8MLL14RH","Lifeline Stud 1/4\" Wire-8mm x 2 3/8 RH  ",23.1,52,16.170000000000002]
["8MLL14LH","Lifeline Stud 1/4\" Wire-8mm x 2 3/8 LH  ",23.1,52,16.170000000000002]
[null,null,null,null,""]
["Replacement Lifeline Studs (Handy Crimp)- Turnbuckles",null,null,null,""]
["14CLL18RH","Lifeline Stud/HC 1/8\" Wire 1/4-28x2 1/4 RH",11.42,52,7.9939999999999998]
["14CLL18LH","Lifeline Stud/HC 1/8\" Wire 1/4-28x2 1/4 LH",11.42,52,7.9939999999999998]
["14CLL316RH","Lifeline Stud/HC 3/16\" Wire 1/4-28x2 1/4 RH",12.83,52,8.9809999999999999]
["14CLL316LH","Lifeline Stud/HC 3/16\" Wire 1/4-28x2 1/4 LH",12.83,52,8.9809999999999999]
["516CLL316RH","Lifeline Stud/HC 3/16\" Wire 5/16-24x2 3/8 RH",12.65,52,8.8550000000000004]
["516CLL316LH","Lifeline Stud/HC 3/16\" Wire 5/16-24x2 3/8 LH",12.65,52,8.8550000000000004]
[null,null,null,null,""]
["Replacement Lifeline Studs (Handy Crimp)- Pelican Hooks",null,null,null,""]
["14CLLP18RH","Lifeline Stud/HC 1/8\"Wire 1/4-28x1 1/2 RH",10.97,52,7.6790000000000003]
["14CLLP18LH","Lifeline Stud/HC 1/8\"Wire 1/4-28x1 1/2 LH",10.97,52,7.6790000000000003]
["14CLLP316RH","Lifeline Stud/HC 3/16\"Wire 1/4-28x1 1/2 RH",12.55,52,8.7850000000000001]
["14CLLP316LH","Lifeline Stud/HC 3/16\"Wire 1/4-28x1 1/2 LH",12.55,52,8.7850000000000001]
[null,null,null,null,""]
["Replacement Lifeline Studs (Handy Crimp)- Eyes",null,null,null,""]
["14CLLE18RH","Lifeline Stud/HC 1/8\"Wire 1/4-28x7/16 RH",10.37,52,7.2589999999999986]
["14CLLE18LH","Lifeline Stud/HC 1/8\"Wire 1/4-28x7/16 LH",10.37,52,7.2589999999999986]
["516CLLE316RH","Lifeline Stud/HC 3/16\"Wire 5/16-24x7/16 RH",11.87,52,8.3089999999999993]
["516CLLE316LH","Lifeline Stud/HC 3/16\"Wire 5/16-24x7/16 LH",11.87,52,8.3089999999999993]
[null,null,null,null,""]
["Replacement Lifeline Studs (Handy Crimp)- Lifeline Adjusters",null,null,null,""]
["14CLL18RH","Lifeline Stud/HC 1/8\"Wire 1/4-28x2 1/4 RH",11.42,52,7.9939999999999998]
["14CLL316RH","Lifeline Stud/HC 3/16\"Wire 1/4-28x2 1/4 RH",12.83,52,8.9809999999999999]
["14ASCLL316RH","Lifeline Stud/HC 3/16\"Wire 1/4-28x3 1/4 RH",15.53,52,10.870999999999999]
[null,null,null,null,""]
["Replacement Lifeline Studs (Handy Crimp)- Miscellaneous",null,null,null,""]
["14CLLE18RH","Lifeline Stud/HC 1/8\"Wire 1/4-28x7/16 RH",10.37,52,7.2589999999999986]
["14CLLE18LH","Lifeline Stud/HC 1/8\"Wire 1/4-28x7/16 LH",10.37,52,7.2589999999999986]
["516CLLP316RH","Lifeline Stud/HC 3/16\"WRE 5/16-24x11/2 RH",12.2,52,8.5399999999999991]
["516CLLP316LH","Lifeline Stud/HC 3/16\"WRE 5/16-24x1 1/2 LH",12.2,52,8.5399999999999991]
[null,null,null,null,""]
["Replacement Lifeline Studs (Machine Swage) - Turnbuckles - Metric Wire Sizes",null,null,null,""]
["14LLM03RH","Lifeline Stud 3mm Wire-1/4-28 x 2 1/4 RH",7.23,53,5.0609999999999999]
["14LLM03LH","Lifeline Stud 3mm Wire-1/4-28 x 2 1/4 LH",7.23,53,5.0609999999999999]
["14LLM04RH","Lifeline Stud 4mm Wire-1/4-28 x 2 1/4 RH",8.31,53,5.8170000000000002]
["14LLM04LH","Lifeline Stud 4mm Wire-1/4-28 x 2 1/4 LH",8.31,53,5.8170000000000002]
["14LLM05RH","Lifeline Stud 5mm Wire-1/4-28 x 2 1/4 RH",9.52,53,6.6639999999999997]
["14LLM05LH","Lifeline Stud 5mm Wire-1/4-28 x 2 1/4 LH",9.52,53,6.6639999999999997]
["516LLM05RH","Lifeline Stud 5mm Wire-5/16-24 x 2 3/8 RH",9.6300000000000008,53,6.7410000000000005]
["516LLM05LH","Lifeline Stud 5mm Wire-5/16-24 x 2 3/8 LH",9.6300000000000008,53,6.7410000000000005]
["516LLM06RH","Lifeline Stud 6mm Wire-5/16-24 x 2 3/8 RH",17.170000000000002,53,12.019]
["516LLM06LH","Lifeline Stud 6mm Wire-5/16-24 x 2 3/8 LH",17.170000000000002,53,12.019]
["38LLM06RH","Lifeline Stud 6mm Wire-3/8-24 x 2 3/4 RH ",17.170000000000002,53,12.019]
["38LLM06LH","Lifeline Stud 6mm Wire-3/8-24 x 2 3/4 LH ",17.170000000000002,53,12.019]
[null,null,null,null,""]
["Replacement Lifeline Studs (Machine Swage) - Pelican Hooks - Metric Wire Sizes",null,null,null,""]
["14LLPM03LH","Lifeline Stud 3mm Wire-1/4-28 x1 1/2 LH",7.07,53,4.9489999999999998]
["14LLPM04LH","Lifeline Stud 4mm Wire-1/4-28x1 1/2 LH",8.74,53,6.1179999999999994]
["14LLPM05LH","Lifeline Stud 5mm Wire-1/4-28x1 1/2 LH",9.36,53,6.5519999999999996]
[null,null,null,null,""]
["Replacement Lifeline Studs - (Machine Swage) - Eyes - Metric Wire Sizes",null,null,null,""]
["14LLEM03RH","Lifeline Stud 3mm Wire-1/4-28 x 7/16 RH",7.61,53,5.327]
["14LLEM03LH","Lifeline Stud 3mm Wire-1/4-28 x 7/16 LH",7.61,53,5.327]
["516LLEM04RH","Lifeline Stud 4mm Wire-5/16-24x7/16 RH",8.15,53,5.7050000000000001]
["516LLEM04LH","Lifeline Stud 4mm Wire-5/16-24x7/16 LH",8.15,53,5.7050000000000001]
["516LLEM05RH","Lifeline Stud 5mm Wire-5/16-24x7/16 RH ",8.8000000000000007,53,6.16]
["516LLEM05LH","Lifeline Stud 5mm Wire-5/16-24x7/16 LH ",8.8000000000000007,53,6.16]
["516LLEM06RH","Lifeline Stud 6mm Wire-5/16-24x7/16 RH ",15.24,53,10.667999999999999]
["516LLEM06LH","Lifeline Stud 6mm Wire-5/16-24x7/16 LH ",15.24,53,10.667999999999999]
["38LLEM06RH","Lifeline Stud 6mm Wire-3/8-24x7/16 RH  ",15.24,53,10.667999999999999]
["38LLEM06LH","Lifeline Stud 6mm Wire-3/8-24x7/16 LH  ",15.24,53,{"$f":"IF(ISBLANK(C2249),\"\",C2249*$E$5)","v":10.667999999999999}]
[null,null,null,null,""]
["Replacement Lifeline Studs (Machine Swage) - Lifeline Adjusters - Metric Wire Sizes",null,null,null,""]
["14ASLLM03RH","Lifeline Stud 3mm Wire-1/4-28 x3 1/4 RH",7.94,53,5.5579999999999998]
["14ASLLM04RH","Lifeline Stud 4mm Wire-1/4-28x3 1/4 RH",10.02,53,7.0139999999999993]
["14ASLLM05RH","Lifeline Stud 5mm Wire-1/4-28 x3 1/2RH",10.95,53,7.6649999999999991]
[null,null,null,null,""]
["Replacement Pelican Hook Bodies",null,null,null,""]
["FPHB3RH","Pelican Hook Body 3\" - 1/4-28\" RH       ",28.89,54,20.222999999999999]
["FPHBRH","Pelican Hook Body 4\" - 5/16-24 RH       ",30.24,54,21.167999999999999]
["FPHBLH","Pelican Hook Body 4\" - 5/16-24 LH       ",30.24,54,21.167999999999999]
[null,null,null,null,""]
["Replacement Lifeline Gate Eyes - Single (Without Studs)",null,null,null,""]
["14ELLS","Lifeline Gate Eye Single Eye 1/4-28 LH  ",12.65,54,8.8550000000000004]
["516ELLS","Lifeline Gate Eye Single Eye 5/16-24LH  ",12.65,54,8.8550000000000004]
["38ELLS","Lifeline Gate Eye Single Eye 3/8-24 LH  ",12.65,54,8.8550000000000004]
[null,null,null,null,""]
["Replacement Lifeline Gate Eyes - Interlocking Eyes (Without Studs)",null,null,null,""]
["14ELLI","Lifeline Gate Eye Interlocking 1/4-28 LH",27.88,54,19.515999999999998]
["516ELLI","Lifeline Gate Eye Interlocking 5/16-24LH",27.88,54,19.515999999999998]
["38ELLI","Lifeline Gate Eye Interlocking 3/8-24 LH",27.88,54,19.515999999999998]
[null,null,null,null,""]
["Additional Hardware / Tools Section",null,null,null,""]
[null,null,null,null,""]
["Pad Eye",null,null,null,""]
["PE1","Pad Eye                                 ",17.68,55,12.375999999999999]
[null,null,null,null,""]
["Stanchion Eye",null,null,null,""]
["14SER","Stanchion Eye - 1\" RAIL - 1 LOOP        ",20.02,55,14.013999999999999]
["14SER2","Stanchion Eye 1\" RAIL - 2 LOOP          ",24.59,55,17.212999999999997]
[null,null,null,null,""]
["Pulpit Anchor",null,null,null,""]
["14PA","Pulpit Anchor 1/2\" Hole - 1\" Rail       ",13.4,55,9.379999999999999]
[null,null,null,null,""]
["Conversion Sleeves",null,null,null,""]
["CSLL","Conversion Sleeve Mach Swage 3/16\" to 1/8\" ",1.52,55,1.0639999999999998]
["CSLLC","Conversion Sleeve Handy Crimp 3/16\" to 1/8\"",2.2999999999999998,55,1.6099999999999999]
[null,null,null,null,""]
["Hold Collars",null,null,null,""]
["HC18","Hold Collar 1/8\" to 7/32\" Wire-1/4\" Hole",7.95,55,5.5649999999999995]
["HC316","Hold Collar 3/16 to 5/16 Wire-5/16 Hole ",7.95,55,5.5649999999999995]
["HC38","Hold Collar 1/4\" to /3/8\" Wire-3/8\" Hole",13.35,55,9.3449999999999989]
[null,null,null,null,""]
["Copper Oval Sleeves",null,null,null,""]
["SLC116","Copper Oval Sleeve 1/16\" (Zinc Plated)  ",0.24,56,0.16799999999999998]
["SLC332","Copper Oval Sleeve 3/32\" (Zinc Plated)  ",0.62,56,0.434]
["SLC18","Copper Oval Sleeve 1/8\" (Zinc Plated)   ",1.1299999999999999,56,0.79099999999999993]
["SLC532","Copper Oval Sleeve 5/32\" (Zinc Plated)  ",1.9,56,1.3299999999999998]
["SLC316","Copper Oval Sleeve 3/16\" (Zinc Plated)  ",2.83,56,1.9809999999999999]
["SLC732","Copper Oval Sleeve 7/32\" (Zinc Plated)  ",3.16,56,2.2119999999999997]
["SLC14","Copper Oval Sleeve 1/4\" (Zinc Plated)   ",4.41,56,3.0869999999999997]
["SLC516","Copper Oval Sleeve 5/16\" (Zinc Plated)  ",5.69,56,3.9830000000000001]
["SLC38","Copper Oval Sleeve 3/8\" (Zinc Plated)   ",7.89,56,5.5229999999999997]
[null,null,null,null,""]
["Wire Rope Clips",null,null,null,""]
["WRC2","Wire Rope Clip 1/8\" Wire                ",4.05,56,2.8349999999999995]
["WRC4","Wire Rope Clip 5/32\" to 3/16\" Wire      ",5.51,56,3.8569999999999998]
["WRC6","Wire Rope Clip 7/32\" to 1/4\" Wire       ",5.92,56,4.1440000000000001]
["WRC8","Wire Rope Clip 9/32\" to 5/16\" Wire      ",7.38,56,5.1659999999999995]
["WRC10","Wire Rope Clip 3/8\" Wire                ",12.75,56,8.9249999999999989]
["WRC12","Wire Rope Clip 1/2\" Wire                ",15.87,56,11.108999999999998]
["WRC14","Wire Rope Clip 9/16\" Wire               ",18.79,56,13.152999999999999]
["WRC16","Wire Rope Clip 5/8\" Wire                ",21.86,56,15.301999999999998]
[null,null,null,null,""]
["Thimbles",null,null,null,{"$f":"IF(ISBLANK(C2313),\"\",C2313*$E$5)","v":""}]
["TH332","Thimble - 3/32\" Wire - Stainless Steel  ",1.07,56,0.749]
["TH18","Thimble - 1/8\" Wire - Stainless Steel   ",1.21,56,0.84699999999999998]
["TH532","Thimble - 5/32\" Wire - Stainless Steel  ",1.77,56,1.2389999999999999]
["TH316","Thimble - 3/16\" Wire - Stainless Steel  ",2.11,56,1.4769999999999999]
["TH732","Thimble - 7/32\" Wire - Stainless Steel  ",2.2799999999999998,56,1.5959999999999999]
["TH14","Thimble - 1/4\" Wire - Stainless Steel   ",2.5299999999999998,56,1.7709999999999997]
["TH516","Thimble - 5/16\" Wire - Stainless Steel  ",2.83,56,1.9809999999999999]
["TH38","Thimble - 3/8\" Wire - Stainless Steel   ",6.75,56,4.7249999999999996]
["TH12","Thimble - 1/2\" Wire - Stainless Steel   ",11.91,56,8.3369999999999997]
[null,null,null,null,""]
["HRD -Shackles - High Resistance Stainless Steel D Shackles",null,null,null,""]
["HM-HRD06","Hi-Mod Hi Resistance D Shackle - 6MM    ",26.74,57,18.717999999999996]
["HM-HRD08","Hi-Mod Hi Resistance D Shackle - 8MM    ",40.119999999999997,57,28.083999999999996]
["HM-HRD10","Hi-Mod Hi Resistance D Shackle - 10MM   ",66.87,57,46.808999999999997]
["HM-HRD12","Hi-Mod Hi Resistance D Shackle - 12MM   ",100.31,57,70.216999999999999]
["HM-HRD14","Hi-Mod Hi Resistance D Shackle - 14MM   ",183.9,57,128.72999999999999]
["HM-HRD16","Hi-Mod Hi Resistance D Shackle - 16MM   ",227.38,57,159.166]
["HM-HRD20","Hi-Mod Hi Resistance D Shackle - 20MM   ",351.08,57,245.75599999999997]
[null,null,null,null,""]
["D Shackles - Standard Screw Pin",null,null,null,""]
["HM-D04","Hi-Mod D Shackle Std Screw Pin - 5/32\"  ",8.0299999999999994,57,5.6209999999999996]
["HM-D05","Hi-Mod D Shackle Std Screw Pin - 3/16\"  ",9.36,57,6.5519999999999996]
["HM-D06","Hi-Mod D Shackle Std Screw Pin - 1/4\"   ",10.86,57,7.6019999999999994]
["HM-D08","Hi-Mod D Shackle Std Screw Pin - 5/16\"  ",14.22,57,9.9540000000000006]
["HM-D10","Hi-Mod D Shackle Std Screw Pin - 3/8\"   ",26.74,57,18.717999999999996]
["HM-D11","Hi-Mod D Shackle Std Screw Pin - 7/16\"  ",33.44,57,23.407999999999998]
["HM-D12","Hi-Mod D Shackle Std Screw Pin - 1/2\"   ",43.47,57,30.428999999999998]
["HM-D16","Hi-Mod D Shackle Std Screw Pin - 9/16\"  ",100.31,57,70.216999999999999]
["HM-D19","Hi-Mod D Shackle Std Screw Pin - 5/8\"   ",200.62,57,140.434]
[null,null,null,null,""]
["D Shackles - Socket Head Pin",null,null,null,""]
["HM-D05C","Hi-Mod D Shackle Skt Head Pin - 3/16\"   ",12.71,57,8.8970000000000002]
["HM-D06C","Hi-Mod D Shackle Skt Head Pin - 1/4\"    ",15.05,57,10.535]
["HM-D08C","Hi-Mod D Shackle Skt Head Pin - 5/16\"   ",20.059999999999999,57,14.041999999999998]
["HM-D10C","Hi-Mod D Shackle Skt Head Pin - 3/8\"    ",33.44,57,23.407999999999998]
["HM-D11C","Hi-Mod D Shackle Skt Head Pin - 7/16\"   ",43.47,57,30.428999999999998]
["HM-D12C","Hi-Mod D Shackle Skt Head Pin - 1/2\"    ",60.17,57,42.119]
["HM-D16C","Hi-Mod D Shackle Skt Head Pin - 5/8\"    ",117.02,57,81.913999999999987]
["HM-D19C","Hi-Mod D Shackle Skt Head Pin - 3/4\"    ",227.38,57,159.166]
[null,null,null,null,""]
["D Shackles - Shake Proof Pin",null,null,null,""]
["HM-D05RS","Hi-Mod D Shackle Shk Proof Pin - 3/16\"  ",12.54,57,8.7779999999999987]
["HM-D06RS","Hi-Mod D Shackle Shk Proof Pin - 1/4\"   ",15.05,57,10.535]
["HM-D08RS","Hi-Mod D Shackle Shk Proof Pin - 5/16\"  ",20.059999999999999,57,14.041999999999998]
["HM-D10RS","Hi-Mod D Shackle Shk Proof Pin - 3/8\"   ",31.76,57,22.231999999999999]
["HM-D11RS","Hi-Mod D Shackle Shk Proof Pin - 7/16\"  ",51.83,57,36.280999999999999]
["HM-D12RS","Hi-Mod D Shackle Shk Proof Pin - 1/2\"   ",56.84,57,39.787999999999997]
["HM-D16RS","Hi-Mod D Shackle Shk Proof Pin - 5/8\"   ",130.4,57,91.28]
[null,null,null,null,""]
["WD - Wide D Shackles - Standard Screw Pin",null,null,null,""]
["HM-WD05","Hi-Mod Shackle Wide \"D\" Std Pin - 3/16\" ",18.39,57,12.872999999999999]
["HM-WD06","Hi-Mod Shackle Wide \"D\" Std Pin - 1/4\"  ",24.41,57,17.087]
["HM-WD08","Hi-Mod Shackle Wide \"D\" Std Pin - 5/16\" ",31.76,57,22.231999999999999]
["HM-WD10","Hi-Mod Shackle Wide \"D\" Std Pin - 3/8\"  ",50.16,57,35.111999999999995]
[null,null,null,null,""]
["Long D Shackle - Standard Screw Pin",null,null,null,""]
["HM-LD04","Hi-Mod Shackle Lng D Std Screw Pin-5/32\"",10.86,58,7.6019999999999994]
["HM-LD05","Hi-Mod Shackle Lng D Std Screw Pin-3/16\"",11.7,58,8.19]
["HM-LD06","Hi-Mod Shackle Lng D Std Screw Pin-1/4\" ",13.37,58,9.3589999999999982]
["HM-LD08","Hi-Mod Shackle Lng D Std Screw Pin-5/16\"",20.059999999999999,58,14.041999999999998]
["HM-LD10","Hi-Mod Shackle Lng D Std Screw Pin-3/8\" ",33.44,58,23.407999999999998]
[null,null,null,null,""]
["Long D Shackle - Socket Head Pin",null,null,null,""]
["HM-LD05C","Hi-Mod Shackle Lng D Skt Head Pin-5/32\" ",13.37,58,{"$f":"IF(ISBLANK(C2377),\"\",C2377*$E$5)","v":9.3589999999999982}]
["HM-LD06C","Hi-Mod Shackle Lng D Skt Head Pin-1/4\"  ",15.05,58,10.535]
["HM-LD08C","Hi-Mod Shackle Lng D Skt Head Pin-5/16\" ",23.41,58,16.387]
["HM-LD10C","Hi-Mod Shackle Lng D Skt Head Pin-3/8\"  ",40.119999999999997,58,28.083999999999996]
[null,null,null,null,""]
["Long D Shackle - Shake Proof Pin",null,null,null,""]
["HM-LD05RS","Hi-Mod Shackle Lng D Shk Proof Pin-3/16\"",13.37,58,9.3589999999999982]
["HM-LD06RS","Hi-Mod Shackle Lng D Shk Proof Pin-1/4\" ",18.39,58,12.872999999999999]
["HM-LD08RS","Hi-Mod Shackle Lng D Shk Proof Pin-5/16\"",25.07,58,17.548999999999999]
["HM-LD10RS","Hi-Mod Shackle Lng D Shk Proof Pin-3/8\" ",36.770000000000003,58,25.739000000000001]
[null,null,null,null,""]
["Bow Shackle - Standard Screw Pin",null,null,null,""]
["HM-B04","Hi-Mod BOW Shackle Std Screw Pin - 5/32\"",9.19,58,6.4329999999999989]
["HM-B05","Hi-Mod BOW Shackle Std Screw Pin - 3/16\"",10.039999999999999,58,7.0279999999999987]
["HM-B06","Hi-Mod BOW Shackle Std Screw Pin - 1/4\" ",11.7,58,8.19]
["HM-B08","Hi-Mod BOW Shackle Std Screw Pin - 5/16\"",20.059999999999999,58,14.041999999999998]
["HM-B10","Hi-Mod BOW Shackle Std Screw - 3/8\"     ",26.74,58,18.717999999999996]
["HM-B11","Hi-Mod BOW Shackle Std Screw - 7/16\"    ",33.44,58,23.407999999999998]
["HM-B12","Hi-Mod BOW Shackle Std Screw Pin - 1/2\" ",43.47,58,30.428999999999998]
["HM-B16","Hi-Mod BOW Shackle Std Screw Pin - 9/16\"",100.31,58,70.216999999999999]
["HM-B19","Hi-Mod BOW Shackle Std Screw Pin - 5/8\" ",200.62,58,140.434]
[null,null,null,null,""]
["Bow Shackle - Socket Head Pin",null,null,null,""]
["HM-B05C","Hi-Mod BOW Shackle Skt Head Pin - 3/16\" ",11.7,58,8.19]
["HM-B06C","Hi-Mod BOW Shackle Skt Head Pin - 1/4\"  ",16.72,58,11.703999999999999]
["HM-B08C","Hi-Mod BOW Shackle Skt Head Pin - 5/16\" ",25.07,58,17.548999999999999]
["HM-B10C","Hi-Mod BOW Shackle Skt Head Pin - 3/8\"  ",40.119999999999997,58,28.083999999999996]
["HM-B11C","Hi-Mod BOW Shackle Skt Head Pin - 7/16\" ",46.8,58,32.76]
["HM-B12C","Hi-Mod BOW Shackle Skt Head Pin - 1/2\"  ",60.17,58,42.119]
["HM-B16C","Hi-Mod BOW Shackle Skt Head Pin - 9/16\" ",120.37,58,84.259]
["HM-B19C","Hi-Mod BOW Shackle Skt Head Pin - 5/8\"  ",224.02,58,156.81399999999999]
[null,null,null,null,""]
["Bow Shackle - Shake Proof Pin",null,null,null,""]
["HM-B05RS","Hi-Mod BOW Shackle Shk Proof Pin - 3/16\"",13.37,58,9.3589999999999982]
["HM-B06RS","Hi-Mod BOW Shackle Shk Proof Pin - 1/4\" ",15.88,58,11.116]
["HM-B08RS","Hi-Mod BOW Shackle Shk Proof Pin - 5/16\"",23.41,58,16.387]
["HM-B10RS","Hi-Mod BOW Shackle Shk Proof Pin - 3/8\" ",33.44,58,23.407999999999998]
["HM-B11RS","Hi-Mod BOW Shackle Shk Proof Pin - 7/16\"",38.46,58,26.922000000000001]
["HM-B12RS","Hi-Mod BOW Shackle Shk Proof Pin - 1/2\" ",58.51,58,40.956999999999994]
["HM-B16RS","Hi-Mod BOW Shackle Shk Proof Pin - 5/8\" ",133.74,58,93.617999999999995]
[null,null,null,null,""]
["Twisted Shackles - Standard Screw Pin",null,null,null,""]
["HM-T04","Hi-Mod Shackle Twist Std Head Pin-5/32\" ",11.7,59,8.19]
["HM-T05","Hi-Mod Shackle Twist Std Head Pin-3/16\" ",12.54,59,8.7779999999999987]
["HM-T06","Hi-Mod Shackle Twist Std Head Pin-1/4\"  ",13.37,59,9.3589999999999982]
["HM-T08","Hi-Mod Shackle Twist Std Head Pin-5/16\" ",23.41,59,16.387]
["HM-T10","Hi-Mod Shackle Twist Std Head Pin-3/8\"  ",33.44,59,23.407999999999998]
["HM-T11","Hi-Mod Shackle Twist Std Head Pin-7/16\" ",36.770000000000003,59,25.739000000000001]
["HM-T12","Hi-Mod Shackle Twist Std Head Pin-1/2\"  ",46.8,59,32.76]
["HM-T16","Hi-Mod Shackle Twist Std Head Pin-5/8\"  ",107.01,59,74.906999999999996]
["HM-T19","Hi-Mod Shackle Twist Std Head Pin-3/4\"  ",224.02,59,156.81399999999999]
[null,null,null,null,""]
["Twisted Shackles - Socket Head Pin",null,null,null,""]
["HM-T05C","Hi-Mod Shackle Twist Skt Head Pin-3/16\" ",15.05,59,10.535]
["HM-T06C","Hi-Mod Shackle Twist Skt Head Pin-1/4\"  ",16.72,59,11.703999999999999]
["HM-T08C","Hi-Mod Shackle Twist Skt Head Pin-5/16\" ",21.74,59,15.217999999999998]
["HM-T10C","Hi-Mod Shackle Twist Skt Head Pin-3/8\"  ",36.770000000000003,59,25.739000000000001]
["HM-T11C","Hi-Mod Shackle Twist Skt Head Pin-7/16\" ",40.119999999999997,59,28.083999999999996]
["HM-T12C","Hi-Mod Shackle Twist Skt Head Pin-1/2\"  ",50.16,59,35.111999999999995]
["HM-T16C","Hi-Mod Shackle Twist Skt Head Pin-5/8\"  ",117.02,59,81.913999999999987]
["HM-T19C","Hi-Mod Shackle Twist Skt Head Pin-3/4\"  ",234.05,59,163.83500000000001]
[null,null,null,null,""]
["Twisted Shackles - Shake Proof Pin",null,null,null,""]
["HM-T05RS","Hi-Mod Shackle Twist Shk Proof Pin-3/16\"",16.72,59,11.703999999999999]
["HM-T06RS","Hi-Mod Shackle Twist Shk Proof Pin-1/4\" ",19.22,59,{"$f":"IF(ISBLANK(C2441),\"\",C2441*$E$5)","v":13.453999999999999}]
["HM-T08RS","Hi-Mod Shackle Twist Shk Proof Pin-5/16\"",25.91,59,18.137]
["HM-T10RS","Hi-Mod Shackle Twist Shk Proof Pin-3/8\" ",36.770000000000003,59,25.739000000000001]
["HM-T11RS","Hi-Mod Shackle Twist Shk Proof Pin-7/16\"",41.8,59,29.259999999999994]
["HM-T12RS","Hi-Mod Shackle Twist Shk Proof Pin-1/2\" ",53.5,59,37.449999999999996]
["HM-T16RS","Hi-Mod Shackle Twist Shk Proof Pin-5/8\" ",127.07,59,88.948999999999984]
[null,null,null,null,""]
["Twisted Shackles - Long - Standard Screw Pin",null,null,null,""]
["HM-LT04","Hi-Mod Shackle Twist Std Screw Pin-5/32\"",12.54,59,8.7779999999999987]
["HM-LT05","Hi-Mod Shackle Twist Std Screw Pin-3/16\"",13.37,59,9.3589999999999982]
["HM-LT06","Hi-Mod Shackle Twist Std Screw Pin-1/4\" ",15.05,59,10.535]
["HM-LT08","Hi-Mod Shackle Twist Std Screw Pin-5/16\"",21.74,59,15.217999999999998]
["HM-LT10","Hi-Mod Shackle Twist Std Screw Pin-3/8\" ",36.770000000000003,59,25.739000000000001]
[null,null,null,null,""]
["Twisted Shackles - Long - Socket Head Pin",null,null,null,""]
["HM-LT05C","Hi-Mod Shackle Twist Skt Head Pin-3/16\" ",14.22,59,9.9540000000000006]
["HM-LT06C","Hi-Mod Shackle Twist Skt Head Pin-1/4\"  ",16.72,59,11.703999999999999]
["HM-LT08C","Hi-Mod Shackle Twist Skt Head Pin-5/16\" ",25.07,59,17.548999999999999]
["HM-LT10C","Hi-Mod Shackle Twist Skt Head Pin-3/8\"  ",41.8,59,29.259999999999994]
[null,null,null,null,""]
["Twisted Shackles - Long - Shake Proof Pin",null,null,null,""]
["HM-LT05RS","Hi-Mod Shackle Twist Shk Proof Pin-3/16\"",18.39,59,12.872999999999999]
["HM-LT06RS","Hi-Mod Shackle Twist Shk Proof Pin-1/4\" ",21.74,59,15.217999999999998]
["HM-LT08RS","Hi-Mod Shackle Twist Shk Proof Pin-5/16\"",28.42,59,19.893999999999998]
["HM-LT10RS","Hi-Mod Shackle Twist Shk Proof Pin-3/8\" ",41.8,59,29.259999999999994]
[null,null,""]
["Handy Crimp tool",null,""]
["HCTOOL","Hand Crimp Tool                         ",320.29000000000002,62,"Net Item"]
[null,null,""]
["Cable Cutters",null,""]
["CUTC7","Cable Cutter - up to 1/8\" Wire          ",79.41,62,"Net Item"]
["CUTC9","Cable Cutter - up to 3/16\" Wire         ",176.77,62,"Net Item"]
["CUTC12","Cable Cutter - up to 1/4\" Wire          ",260.75,62,"Net Item"]
["CUTC16","Cable Cutter - up to 3/8\" Wire          ",365.47,62,"Net Item"]

{"sheet":"Saved Configurations","index":5,"n_rows":172,"n_cols":10,"rows_kept":172,"cut":false,"hidden":false,"merged":[]}
[]
[]
[null,"ID NBR","ID","LIST","TYPE","ROW","RANGE","Elem. Cost","Wire Cost","Tot Cost"]
[null,1,"All Hi-Mod with 7/16\" V1",{"$f":"CONCATENATE(B4,\" - \",E4,\" \",C4)","v":"1 - Discontinuous Rigging All Hi-Mod with 7/16\" V1"},"Discontinuous Rigging",{"$f":"(B4-1)*13+19","v":19},{"$f":"CONCATENATE(\"C\",F4,\":J\",F4+10)","v":"C19:J29"},2886.33,1112.01,{"$f":"I4+H4","v":3998.34}]
[null,{"$f":"B4+1","v":2},"Mixed Hi-Mod and Swaged with 7/16\" V1",{"$f":"CONCATENATE(B5,\" - \",E5,\" \",C5)","v":"2 - Discontinuous Rigging Mixed Hi-Mod and Swaged with 7/16\" V1"},"Discontinuous Rigging",{"$f":"(B5-1)*13+19","v":32},{"$f":"CONCATENATE(\"C\",F5,\":J\",F5+10)","v":"C32:J42"},2235.88,1112.01,{"$f":"I5+H5","v":3347.8900000000003}]
[null,{"$f":"B5+1","v":3},"All Hi-Mod with 10mm 1x19 V1","3 - Discontinuous Rigging All Hi-Mod with 10mm 1x19 V1","Discontinuous Rigging",45,"C45:J55",1910.49,1306.94,3217.4300000000003]
[null,4,"All Swaged with 10mm 1x19 V1","4 - Discontinuous Rigging All Swaged with 10mm 1x19 V1","Discontinuous Rigging",58,"C58:J68",1126.8399999999999,1306.94,2433.7799999999997]
[null,5,"Mixed Hi-Mod and Swaged with 10mm 1x19 V1","5 - Discontinuous Rigging Mixed Hi-Mod and Swaged with 10mm 1x19 V1","Discontinuous Rigging",71,"C71:J81",2139.14,1306.94,3446.08]
[null,6,"All swaged with 7/16\" V1","6 - Discontinuous Rigging All swaged with 7/16\" V1","Discontinuous Rigging",84,"C84:J94",1566.73,1112.01,2678.74]
[null,7,"All Hi-Mod","7 - Continuous Rigging All Hi-Mod","Continuous Rigging",97,"C97:J107",1560.94,1112.01,2672.95]
[null,8,"All Hi-Mod 10mm-Compact Strand V1 Swaged forestay","8 - Discontinuous Rigging All Hi-Mod 10mm-Compact Strand V1 Swaged forestay","Discontinuous Rigging",110,"C110:J120",2060.25,1119.45,3179.7]
[null,9,"V1 Price Analysis 10mm Dyrform","9 - Discontinuous Rigging V1 Price Analysis 10mm Dyrform","Discontinuous Rigging",123,"C123:J133",369.47,245.03,614.5]
[null,10,"V1 Price Analysis 7/16 1x19 ",{"$f":"CONCATENATE(B13,\" - \",E13,\" \",C13)","v":"10 - Discontinuous Rigging V1 Price Analysis 7/16 1x19 "},"Discontinuous Rigging",136,{"$f":"CONCATENATE(\"C\",F13,\":J\",F13+10)","v":"C136:J146"},837.28,105.6,942.88]
[null,11,"All Hi-Mod 10mm Compact Strand V1 w/o Forestay","11 - Discontinuous Rigging All Hi-Mod 10mm Compact Strand V1 w/o Forestay","Discontinuous Rigging",149,"C149:J159",1577.28,837.65,2414.9299999999998]
[null,12,"All Hi-Mod 10mm-Compact Strand V1","12 - Discontinuous Rigging All Hi-Mod 10mm-Compact Strand V1","Discontinuous Rigging",162,"C162:J172",2133.65,1119.45,3253.1000000000004]
[null,{"$f":"current_config_lookup_value","v":8},null,"Current",{"$f":"VLOOKUP(current_config_lookup_value,save_meta,4)","v":"Discontinuous Rigging"}]
[]
[null,{"$f":"ROUND(ROW()/13,0)","v":1},{"$f":"CONCATENATE(VLOOKUP(B18,save_meta,4),\" \",VLOOKUP(B18,save_meta,2))","v":"Discontinuous Rigging All Hi-Mod with 7/16\" V1"},"Wire Size","Length \n(m)","Pin (Eye)\nSize","Top\nTerminal","Bottom Terminal","Top Toggle","Bottom Toggle"]
[null,null,2,"10mm",10.199999999999999,"5/8\"","58CTEM10","58CTEM10","",""]
[null,null,2,"7/16\"",5.5,"3/4\"","34CTE716","34CTS716","","34EFBJ"]
[null,null,2,"10mm",15.7,"5/8\"","58CTEM10","58CTSM10","",""]
[null,null,2,"8mm",4,"5/8\"","58CTEM08","58CTSM08","",""]
[null,null,2,"8mm",9.5,"5/8\"","58CTEM08","58CTSM08","",""]
[null,null,4,"8mm",5.2,"5/8\"","58CTEM08","58CTSM08","",""]
[null,null,1,"10mm",15.9,"5/8\"","58CTEM10","58CTSM10","FT-20C","58EFBJ"]
[null,null,1,"11mm",16.559999999999999,"5/8\"","CSS72BLK","CSS72BLK","",""]
[null,null,0,"10mm",16.5,"5/8\"","58CTEM10","58CTEM10","FT-20C",""]
[null,null,0,"8mm",10.5,"1/2\"","12CTSM08","12CTSM08","",""]
[null,null,0,"10mm",0,"n/a","CTICCM10","CTICCM10","",""]
[]
[null,{"$f":"ROUND(ROW()/13,0)","v":2},{"$f":"CONCATENATE(VLOOKUP(B31,save_meta,4),\" \",VLOOKUP(B31,save_meta,2))","v":"Discontinuous Rigging Mixed Hi-Mod and Swaged with 7/16\" V1"},"Wire Size","Length \n(m)","Pin (Eye)\nSize","Top\nTerminal","Bottom Terminal","Top Toggle","Bottom Toggle"]
[null,null,2,"10mm",10.199999999999999,"5/8\"","58RCSEM10","58RCSEM10","",""]
[null,null,2,"7/16\"",5.5,"3/4\"","34RCSE716","34CTS716","","34EFBJ"]
[null,null,2,"10mm",15.7,"5/8\"","58RCSEM10","58CTSM10","","58EFBJ"]
[null,null,2,"8mm",4,"5/8\"","58RCSEM08","58CTSM08","",0]
[null,null,2,"8mm",9.5,"5/8\"","58RCSEM08","58CTSM08","","58EFBJ"]
[null,null,4,"8mm",5.2,"5/8\"","58RCSEM08","58CTSM08","",0]
[null,null,1,"10mm",15.9,"5/8\"","58RCSEM08","34CTSM10","FT-20C",""]
[null,null,1,"11mm",16.559999999999999,"5/8\"","CSS72BLK","CSS72BLK","",""]
[null,null,0,"10mm",16.5,"5/8\"","58RCSEM10","58CTEM10","FT-20C",""]
[null,null,0,"8mm",10.5,"1/2\"","12CTSM08","12CTSM08","",""]
[null,null,0,"10mm",0,"n/a","CTICCM10","CTICCM10","",""]
[]
[null,{"$f":"ROUND(ROW()/13,0)","v":3},{"$f":"CONCATENATE(VLOOKUP(B44,save_meta,4),\" \",VLOOKUP(B44,save_meta,2))","v":"Discontinuous Rigging All Hi-Mod with 10mm 1x19 V1"},"Wire Size","Length \n(m)","Pin (Eye)\nSize","Top\nTerminal","Bottom Terminal","Top Toggle","Bottom Toggle"]
[null,null,2,"10mm",10.199999999999999,"5/8\"","58CTEM10","58CTEM10","",""]
[null,null,2,"10mm",5.5,"5/8\"","58CTEM10","58CTEM10","",""]
[null,null,2,"10mm",15.7,"5/8\"","58CTEM10","58CTSM10","","58EFBJ"]
[null,null,2,"8mm",4,"5/8\"","58CTEM08","58CTSM08","",""]
[null,null,2,"8mm",9.5,"5/8\"","58CTEM08","58CTSM08","","58EFBJ"]
[null,null,4,"8mm",5.2,"5/8\"","58CTEM08","58CTSM08","",""]
[null,null,1,"10mm",15.9,"5/8\"","58CTEM10","58CTSM10","FT-20C",""]
[null,null,1,"11mm",16.559999999999999,"5/8\"","CSS72BLK","CSS72BLK","",""]
[null,null,0,"10mm",16.5,"5/8\"","58CTEM10","58CTEM10","FT-20C",""]
[null,null,0,"8mm",10.5,"1/2\"","12CTSM08","12CTSM08","",""]
[null,null,0,"10mm",0,"n/a","CTICCM10","CTICCM10","",""]
[]
[null,{"$f":"ROUND(ROW()/13,0)","v":4},{"$f":"CONCATENATE(VLOOKUP(B57,save_meta,4),\" \",VLOOKUP(B57,save_meta,2))","v":"Discontinuous Rigging All Swaged with 10mm 1x19 V1"},"Wire Size","Length \n(m)","Pin (Eye)\nSize","Top\nTerminal","Bottom Terminal","Top Toggle","Bottom Toggle"]
[null,null,2,"10mm",10.199999999999999,"5/8\"","58RCSEM10","58RCSEM10","",""]
[null,null,2,"10mm",5.5,"5/8\"","58RCSEM10","58RCSSM10","",""]
[null,null,2,"10mm",15.7,"5/8\"","58RCSEM10","58RCSSM10","","58EFBJ"]
[null,null,2,"8mm",4,"5/8\"","58RCSEM08","58RCSSM08","",""]
[null,null,2,"8mm",9.5,"5/8\"","58RCSEM08","58RCSSM08","","58EFBJ"]
[null,null,4,"8mm",5.2,"5/8\"","58RCSEM08","58RCSSM08","",""]
[null,null,1,"10mm",15.9,"5/8\"","58RCSEM08","58RCSSM10","FT-20C",""]
[null,null,1,"11mm",16.559999999999999,"5/8\"","CSS72BLK","CSS72BLK","",""]
[null,null,0,"10mm",16.5,"5/8\"","58RCSEM10","58RCSSM10","FT-20C",""]
[null,null,0,"8mm",10.5,"1/2\"","12CTSM08","12CTSM08","",""]
[null,null,0,"10mm",0,"n/a","CTICCM10","CTICCM10","",""]
[]
[null,{"$f":"ROUND(ROW()/13,0)","v":5},{"$f":"CONCATENATE(VLOOKUP(B70,save_meta,4),\" \",VLOOKUP(B70,save_meta,2))","v":"Discontinuous Rigging Mixed Hi-Mod and Swaged with 10mm 1x19 V1"},"Wire Size","Length \n(m)","Pin (Eye)\nSize","Top\nTerminal","Bottom Terminal","Top Toggle","Bottom Toggle"]
[null,null,2,"10mm",10.199999999999999,"5/8\"","58RCSEM10","58RCSEM10","",""]
[null,null,2,"10mm",5.5,"3/4\"","34RCSEM10","58CTSM10","","58EFBJ"]
[null,null,2,"10mm",15.7,"5/8\"","58RCSEM10","58CTSM10","","58EFBJ"]
[null,null,2,"8mm",4,"5/8\"","58RCSEM08","58CTSM08","","58EFBJ"]
[null,null,2,"8mm",9.5,"5/8\"","58RCSEM08","58CTSM08","","58EFBJ"]
[null,null,4,"8mm",5.2,"5/8\"","58RCSEM08","58CTSM08","","58EFBJ"]
[null,null,1,"10mm",15.9,"5/8\"","58RCSEM08","58CTSM10","FT-20C",""]
[null,null,1,"11mm",16.559999999999999,"5/8\"","CSS72BLK","CSS72BLK","",""]
[null,null,0,"10mm",16.5,"5/8\"","58RCSM10","58CTEM10","FT-20C",""]
[null,null,0,"8mm",10.5,"1/2\"","58RCSEM08","12CTSM08","",""]
[null,null,0,"10mm",0,"n/a","CTICCM10","CTICCM10","",""]
[]
[null,{"$f":"ROUND(ROW()/13,0)","v":6},{"$f":"CONCATENATE(VLOOKUP(B83,save_meta,4),\" \",VLOOKUP(B83,save_meta,2))","v":"Discontinuous Rigging All swaged with 7/16\" V1"},"Wire Size","Length \n(m)","Pin (Eye)\nSize","Top\nTerminal","Bottom Terminal","Top Toggle","Bottom Toggle"]
[null,null,2,"10mm",10.199999999999999,"5/8\"","58RCSEM10","58RCSEM10","",""]
[null,null,2,"7/16\"",5.5,"3/4\"","34RCSE716","34RCSS716","","34EFBJ"]
[null,null,2,"10mm",15.7,"5/8\"","58CTEM10","58CTSM10","",""]
[null,null,2,"8mm",4,"5/8\"","58RCSEM08","58RCSSM08","",""]
[null,null,2,"8mm",9.5,"5/8\"","58CTEM08","58CTSM08","",""]
[null,null,4,"8mm",5.2,"5/8\"","58RCSEM08","58RCSSM08","",""]
[null,null,1,"10mm",15.9,"5/8\"","58RCSEM08","58RCSSM10","FT-20C",""]
[null,null,1,"11mm",16.559999999999999,"5/8\"","CSS72BLK","CSS72BLK","",""]
[null,null,0,"10mm",16.5,"5/8\"","58RCSM10","58CTEM10","FT-20C",""]
[null,null,0,"8mm",10.5,"1/2\"","12CTSM08","12CTSM08","",""]
[null,null,0,"10mm",0,"n/a","CTICCM10","CTICCM10","",""]
[]
[null,{"$f":"ROUND(ROW()/13,0)","v":7},{"$f":"CONCATENATE(VLOOKUP(B96,save_meta,4),\" \",VLOOKUP(B96,save_meta,2))","v":"Continuous Rigging All Hi-Mod"},"Wire Size","Length \n(m)","Pin (Eye)\nSize","Top\nTerminal","Bottom Terminal","Top Toggle","Bottom Toggle"]
[null,null,2,"10mm",10.199999999999999,"5/8\"","58CTEM10","58CTEM10","",""]
[null,null,2,"7/16\"",5.5,"3/4\"","34CTE716","34CTS716","","34EFBJ"]
[null,null,2,"10mm",15.7,"5/8\"","58CTEM10","58CTSM10","",0]
[null,null,2,"8mm",4,"5/8\"","58CTEM08","58CTSM08","",0]
[null,null,2,"8mm",9.5,"5/8\"","58CTEM08","58CTSM08","",0]
[null,null,4,"8mm",5.2,"5/8\"","58CTEM08","58CTSM08","",0]
[null,null,1,"10mm",15.9,"5/8\"","58CTEM10","58CTSM10","FT-20C",""]
[null,null,1,"11mm",16.559999999999999,"5/8\"","CSS72BLK","CSS72BLK","",""]
[null,null,0,"10mm",16.5,"5/8\"","58CTEM10","58CTEM10","FT-20C",""]
[null,null,0,"8mm",10.5,"1/2\"","12CTSM08","12CTSM08","",""]
[null,null,0,"10mm",0,"n/a","CTICCM10","CTICCM10","",""]
[]
[null,{"$f":"ROUND(ROW()/13,0)","v":8},{"$f":"CONCATENATE(VLOOKUP(B109,save_meta,4),\" \",VLOOKUP(B109,save_meta,2))","v":"Discontinuous Rigging All Hi-Mod 10mm-Compact Strand V1 Swaged forestay"},"Wire Size","Length \n(m)","Pin (Eye)\nSize","Top\nTerminal","Bottom Terminal","Top Toggle","Bottom Toggle"]
[null,null,2,"10mm",10.199999999999999,"5/8\"","58CTEM10","58CTEM10","",""]
[null,null,2,"10mm-D",5.5,"5/8\"","58CTEM10-D","58CTSM10-D","",""]
[null,null,0,"10mm",15.7,"5/8\"","58CTEM10","58CTSM10","",""]
[null,null,2,"8mm",4,"5/8\"","58CTEM08","58CTSM08","",""]
[null,null,0,"8mm",9.5,"5/8\"","58CTEM08","58CTSM08","",""]
[null,null,4,"8mm",5.2,"5/8\"","58CTEM08","58CTSM08","",""]
[null,null,1,"10mm",15.9,"5/8\"","58CTEM10","58CTSM10","FT-20C","58EFBJ"]
[null,null,1,"11mm",16.559999999999999,"5/8\"","CSS72BLK","CSS72BLK","",""]
[null,null,0,"10mm",16.5,"5/8\"","58CTEM10","58CTEM10","FT-20C",""]
[null,null,1,"8mm",10.6,"1/2\"","58RCSEM08","58RCSSM08","",""]
[null,null,0,"10mm",0,"n/a","CTICCM10","CTICCM10","",""]
[]
[null,{"$f":"ROUND(ROW()/13,0)","v":9},{"$f":"CONCATENATE(VLOOKUP(B122,save_meta,4),\" \",VLOOKUP(B122,save_meta,2))","v":"Discontinuous Rigging V1 Price Analysis 10mm Dyrform"},"Wire Size","Length \n(m)","Pin (Eye)\nSize","Top\nTerminal","Bottom Terminal","Top Toggle","Bottom Toggle"]
[null,null,0,"10mm",10.199999999999999,"5/8\"","58CTEM10","58CTEM10","",""]
[null,null,2,"10mm-D",5.5,"5/8\"","58CTEM10-D","58CTSM10-D","",""]
[null,null,0,"10mm",15.7,"5/8\"","58CTEM10","58CTSM10","",""]
[null,null,0,"8mm",4,"5/8\"","58CTEM08","58CTSM08","",""]
[null,null,0,"8mm",9.5,"5/8\"","58CTEM08","58CTSM08","",""]
[null,null,0,"8mm",5.2,"5/8\"","58CTEM08","58CTSM08","",""]
[null,null,0,"10mm",15.9,"5/8\"","58CTEM10","58CTSM10","FT-20C","58EFBJ"]
[null,null,0,"11mm",16.559999999999999,"5/8\"","CSS72BLK","CSS72BLK","",""]
[null,null,0,"10mm",16.5,"5/8\"","58CTEM10","58CTEM10","FT-20C",""]
[null,null,0,"8mm",10.5,"1/2\"","12CTSM08","12CTSM08","",""]
[null,null,0,"10mm",0,"n/a","CTICCM10","CTICCM10","",""]
[]
[null,{"$f":"ROUND(ROW()/13,0)","v":10},{"$f":"CONCATENATE(VLOOKUP(B135,save_meta,4),\" \",VLOOKUP(B135,save_meta,2))","v":"Discontinuous Rigging V1 Price Analysis 7/16 1x19 "},"Wire Size","Length \n(m)","Pin (Eye)\nSize","Top\nTerminal","Bottom Terminal","Top Toggle","Bottom Toggle"]
[null,null,0,"10mm",10.199999999999999,"5/8\"","58CTEM10","58CTEM10","",""]
[null,null,2,"7/16\"",5.5,"5/8\"","34CTE716","34CTS716","",""]
[null,null,0,"10mm",15.7,"5/8\"","58CTEM10","58CTSM10","",""]
[null,null,0,"8mm",4,"5/8\"","58CTEM08","58CTSM08","",""]
[null,null,0,"8mm",9.5,"5/8\"","58CTEM08","58CTSM08","",""]
[null,null,0,"8mm",5.2,"5/8\"","58CTEM08","58CTSM08","",""]
[null,null,0,"10mm",15.9,"5/8\"","58CTEM10","58CTSM10","FT-20C","58EFBJ"]
[null,null,0,"11mm",16.559999999999999,"5/8\"","CSS72BLK","CSS72BLK","",""]
[null,null,0,"10mm",16.5,"5/8\"","58CTEM10","58CTEM10","FT-20C",""]
[null,null,0,"8mm",10.5,"1/2\"","12CTSM08","12CTSM08","",""]
[null,null,0,"10mm",0,"n/a","CTICCM10","CTICCM10","",""]
[]
[null,{"$f":"ROUND(ROW()/13,0)","v":11},{"$f":"CONCATENATE(VLOOKUP(B148,save_meta,4),\" \",VLOOKUP(B148,save_meta,2))","v":"Discontinuous Rigging All Hi-Mod 10mm Compact Strand V1 w/o Forestay"},"Wire Size","Length \n(m)","Pin (Eye)\nSize","Top\nTerminal","Bottom Terminal","Top Toggle","Bottom Toggle"]
[null,null,2,"10mm",10.199999999999999,"5/8\"","58CTEM10","58CTEM10","",""]
[null,null,2,"10mm-D",5.5,"5/8\"","58CTEM10-D","58CTSM10-D","",""]
[null,null,2,"10mm",15.7,"5/8\"","58CTEM10","58CTSM10","",""]
[null,null,2,"8mm",4,"5/8\"","58CTEM08","58CTSM08","",""]
[null,null,2,"8mm",9.5,"5/8\"","58CTEM08","58CTSM08","",""]
[null,null,4,"8mm",5.2,"5/8\"","58CTEM08","58CTSM08","",""]
[null,null,0,"10mm",15.9,"5/8\"","58CTEM10","58CTSM10","FT-20C","58EFBJ"]
[null,null,1,"11mm",16.559999999999999,"5/8\"","CSS72BLK","CSS72BLK","",""]
[null,null,0,"10mm",16.5,"5/8\"","58CTEM10","58CTEM10","FT-20C",""]
[null,null,0,"8mm",10.5,"1/2\"","12CTSM08","12CTSM08","",""]
[null,null,0,"10mm",0,"n/a","CTICCM10","CTICCM10","",""]
[]
[null,{"$f":"ROUND(ROW()/13,0)","v":12},{"$f":"CONCATENATE(VLOOKUP(B161,save_meta,4),\" \",VLOOKUP(B161,save_meta,2))","v":"Discontinuous Rigging All Hi-Mod 10mm-Compact Strand V1"},"Wire Size","Length \n(m)","Pin (Eye)\nSize","Top\nTerminal","Bottom Terminal","Top Toggle","Bottom Toggle"]
[null,null,2,"10mm",10.199999999999999,"5/8\"","58CTEM10","58CTEM10","",""]
[null,null,2,"10mm-D",5.5,"5/8\"","58CTEM10-D","58CTSM10-D","",""]
[null,null,0,"10mm",15.7,"5/8\"","58CTEM10","58CTSM10","",""]
[null,null,2,"8mm",4,"5/8\"","58CTEM08","58CTSM08","",""]
[null,null,0,"8mm",9.5,"5/8\"","58CTEM08","58CTSM08","",""]
[null,null,4,"8mm",5.2,"5/8\"","58CTEM08","58CTSM08","",""]
[null,null,1,"10mm",15.9,"5/8\"","58CTEM10","58CTSM10","FT-20C","58EFBJ"]
[null,null,1,"11mm",16.559999999999999,"5/8\"","CSS72BLK","CSS72BLK","",""]
[null,null,0,"10mm",16.5,"5/8\"","58CTEM10","58CTEM10","FT-20C",""]
[null,null,1,"8mm",10.6,"1/2\"","12CTEM08","58CTSM08","",""]
[null,null,0,"10mm",0,"n/a","CTICCM10","CTICCM10","",""]